{"text_format":"1","workbook":"xlsx","n_sheets":11,"sheets":["Instructions","quantities report","Totals - QA_QC","manual inputs","Surfacing","Surfacing Summary","quantities report_secondary","manual inputs_secondary","Surfacing_secondary","calc wrksht-rdwy exc Secondary","calc wrksht-emb const Secondary"],"not_rendered":{"charts":0,"images":5,"macros":1,"external_links":1,"defined_names":4,"comments":0,"pivot_tables":0},"unopened":[],"bounds":{"document_bytes":16777216,"sheet_cells":100000,"rows_first":2000,"rows_last":500,"rows_between":2000,"halvings":0,"cell_chars":16384,"cell_head_chars":4096},"cells_cut":0,"cells_raw":0,"read":"whole","date_system":"1900"}

{"sheet":"Instructions","index":0,"n_rows":43,"n_cols":3,"rows_kept":43,"cut":false,"hidden":false,"merged":[[1,1,1,2],[36,2,40,2],[7,2,29,2]]}
[" "]
[null,"Instructions:"]
[null,1,"Add cut and fill volumes to the corridor"]
[null,2,"Run Quantities by Named boundary report and save file in excel format."]
[null,3,"Select the volumes report"]
[]
[null,4,"The report should be in the following format:"]
[]
{"$rows_left_out":36}
{"sheet":"quantities report","index":1,"n_rows":0,"n_cols":0,"rows_kept":0,"cut":false,"hidden":false,"merged":[]}

{"sheet":"Totals - QA_QC","index":2,"n_rows":0,"n_cols":0,"rows_kept":0,"cut":false,"hidden":false,"merged":[]}

{"sheet":"manual inputs","index":3,"n_rows":27,"n_cols":14,"rows_kept":27,"cut":false,"hidden":false,"merged":[[19,3,19,4],[11,3,11,4],[27,3,27,4],[18,3,18,4],[17,3,17,4],[20,3,20,4],[21,3,21,4],[14,3,14,4],[12,3,12,4],[10,3,10,4],[16,3,16,4],[15,3,15,4],[13,3,13,4],[1,1,1,4],[2,3,2,4],[4,3,4,4],[3,3,3,4],[5,3,5,4],[0,1,0,4],[6,3,6,4],[8,3,8,4],[7,3,7,4],[9,3,9,4]]}
[null,"Manually update any YELLOW cells"]
[null,"Conversion Factors",null,null,null,null,null,null,null,"Station Range",null,null,null,"Number of Rows"]
[null,"Material","Factor",null,null,null,null,null,"Add Starting Station",null,null,null,null,{"$f":"LOOKUP(2,1/('quantities report'!A:A<>\"\"),ROW('quantities report'!A:A))","v":{"$error":"#N/A"}}]
[null,"Aggregate Base",139,"lb/ft3"]
[null,"HACP",145.19999999999999,"lb/ft3"]
[null,"AntiStrip",0.01,null,null,null,null,null,null,null,null,null,null,"Aggregate Base"]
[null,"Prime Coat - Asphalt Cutbacks",0.33,"gal/yd2",null,null,null,null,null,null,null,null,null,"Asphalt Concrete Pavement"]
[null,"Prime Coat - Asphalt Cutbacks",251,"gal/ton",null,null,null,null,null,null,null,null,null,"N/A"]
{"$rows_left_out":20}
{"sheet":"Surfacing","index":4,"n_rows":33,"n_cols":27,"rows_kept":33,"cut":false,"hidden":false,"merged":[[1,0,1,1],[0,17,0,19],[5,8,5,10],[5,11,5,13],[2,0,3,1],[5,14,5,16],[4,8,4,10],[4,11,4,13],[4,5,4,7],[4,14,4,16],[4,2,4,4],[5,2,5,4],[5,5,5,7],[2,2,3,3],[2,5,3,6],[2,8,3,9],[2,11,3,12],[2,24,3,25],[4,24,4,26],[5,24,5,26],[2,14,3,15]]}
[null,null,null,null,null,null,null,null,null,null,null,null,null,null,null,null,null,"PAY COLUMNS",null,null,null,null,"(20% of area)"]
["TOTALS",null,{"$f":"SUM(C9:C33)","v":0},0,0,0,0,0,0,0,0,0,0,0,0,0,0,0,0,0,0,0,0,0,{"$f":"SUM(Y9:Y33)","v":0},0,0]
["ORD Component Name",null,"XS_TC_Pavement Layer 1: ",null,{"$f":"VLOOKUP(C5,'manual inputs'!B2:E28,2,FALSE)","v":{"$error":"#N/A"}},"XS_TC_Pavement Layer 2: ",null,{"$f":"VLOOKUP(F5,'manual inputs'!$B$2:$E$28,2,FALSE)","v":{"$error":"#N/A"}},"XS_TC_Pavement Layer 3: ",null,{"$f":"VLOOKUP(I5,'manual inputs'!$B$2:$E$28,2,FALSE)","v":{"$error":"#N/A"}},"XS_TC_Pavement Layer 4: ",null,{"$f":"VLOOKUP(L5,'manual inputs'!$B$2:$E$28,2,FALSE)","v":139},"XS_TC_Pavement Layer 5: ",null,{"$f":"VLOOKUP(O5,'manual inputs'!$B$2:$E$28,2,FALSE)","v":{"$error":"#N/A"}},null,null,null,{"$f":"VLOOKUP(U5,'manual inputs'!$B$2:$E$28,2,FALSE)","v":0.1},{"$f":"VLOOKUP(V5,'manual inputs'!$B$2:$E$28,2,FALSE)","v":0.27},{"$f":"VLOOKUP(W5,'manual inputs'!$B$2:$E$28,2,FALSE)","v":14.75},{"$f":"VLOOKUP(X5,'manual inputs'!$B$2:$E$28,2,FALSE)","v":0.1},"Total Existing Pavement: ",null,{"$f":"VLOOKUP(Y5,'manual inputs'!$B$2:$E$28,2,FALSE)","v":4}]
[null,null,null,null,{"$f":"VLOOKUP(C5,'manual inputs'!B2:E270,3,FALSE)","v":{"$error":"#N/A"}},null,null,{"$f":"VLOOKUP(F5,'manual inputs'!$B$2:$E$28,3,FALSE)","v":{"$error":"#N/A"}},null,null,{"$f":"VLOOKUP(I5,'manual inputs'!$B$2:$E$28,3,FALSE)","v":{"$error":"#N/A"}},null,null,{"$f":"VLOOKUP(L5,'manual inputs'!$B$2:$E$28,3,FALSE)","v":"lb/ft3"},null,null,{"$f":"VLOOKUP(O5,'manual inputs'!$B$2:$E$28,3,FALSE)","v":{"$error":"#N/A"}},null,null,null,{"$f":"VLOOKUP(U5,'manual inputs'!$B$2:$E$28,3,FALSE)","v":"gal/yd2"},{"$f":"VLOOKUP(V5,'manual inputs'!$B$2:$E$28,3,FALSE)","v":"gal/yd2"},{"$f":"VLOOKUP(W5,'manual inputs'!$B$2:$E$28,3,FALSE)","v":"lb/yd2"},{"$f":"VLOOKUP(X5,'manual inputs'!$B$2:$E$28,3,FALSE)","v":"gal/yd2"},null,null,{"$f":"VLOOKUP(Y5,'manual inputs'!$B$2:$E$28,3,FALSE)","v":"inches"}]
[null,null,{"$f":"LOOKUP(C6,'manual inputs'!$B$23:$B$27,'manual inputs'!C23:C27)","v":"Asphalt Concrete Pavement"},null,null,{"$f":"LOOKUP(F6,'manual inputs'!$B$23:$B$27,'manual inputs'!C23:C27)","v":"N/A"},null,null,{"$f":"LOOKUP(I6,'manual inputs'!B23:B27,'manual inputs'!C23:C27)","v":"N/A"},null,null,{"$f":"LOOKUP(L6,'manual inputs'!B23:B27,'manual inputs'!C23:C27)","v":"Aggregate Base"},null,null,{"$f":"LOOKUP(O6,'manual inputs'!B23:B27,'manual inputs'!C23:C27)","v":"N/A"},null,null,"Total Aggregate Base","Total Asphalt Concrete Pavement","ANTISTRIP","Fog Seal - Asphalt Emulsion",{"$f":"IF('manual inputs'!C19=\"Asphalt Emulsion\",'manual inputs'!B9,'manual inputs'!B7)","v":"Prime Coat - Asphalt Emulsion"},"Blotter","Tack Coat - Asphalt Emulsion","Existing Pavement"]
[null,null,"Layer 1",null,null,"Layer 2",null,null,"Layer 3",null,null,"Layer 4",null,null,"Layer 5"]
[null,null,"CUYD","CUFT","TON","CUYD","CUFT","TON","CUYD","CUFT","TON","CUYD","CUFT","TON","CUYD","CUFT","TON","TON","TON","TON","TON","TON","TON","TON","CUYD","CUFT","SQYD"]
[null,{"$f":"IFERROR(INDEX('manual inputs'!J:J,SMALL(IF('manual inputs'!J:J<>\"\",ROW('manual inputs'!J:J)),ROW('manual inputs'!2:2))),\"\")","v":""}]
{"$rows_left_out":26}
{"sheet":"Surfacing Summary","index":5,"n_rows":53,"n_cols":14,"rows_kept":53,"cut":false,"hidden":false,"merged":[[28,0,28,1],[11,0,11,1],[12,0,12,1],[1,0,10,0],[1,1,10,1],[5,4,5,13],[6,4,6,6],[48,14,48,23],[47,14,47,23],[7,9,11,9],[7,10,11,10],[7,11,11,11],[44,4,44,6],[7,4,12,6],[7,7,11,7],[7,8,11,8],[28,4,28,6],[7,12,11,12],[7,13,11,13]]}
[]
["<---Type Beginning Row Number","<---Automatic calculates except for last row",null,null,"NOTE TO DESIGNER:  EXAMPLE PAY ITEMS SHOWN…ADJUST TO FIT PROJECT SPECIFIC REQUIREMENTS"]
[]
[null,null,null,null,"Check Totals ------->",null,null,{"$f":"Surfacing!R2+Surfacing_secondary!R2","v":0},{"$f":"Surfacing!R2+Surfacing_secondary!R2","v":0},{"$f":"Surfacing!S2+Surfacing_secondary!S2","v":0},{"$f":"Surfacing!T2+Surfacing_secondary!T2","v":0},{"$f":"Surfacing!U2+Surfacing_secondary!U2","v":0},{"$f":"Surfacing!V2+Surfacing_secondary!V2","v":0},{"$f":"Surfacing!X2+Surfacing_secondary!X2","v":0}]
[]
[null,null,null,null,"SURFACING SUMMARY"]
[null,null,null,null,null,null,null,"20303-1600","30202-2000","40101-1000","40105-3000","40601-0000","41103-0000","41201-0000"]
[null,null,null,null,"Station to Station",null,null,{"$f":"IF(ISBLANK(H7),\" \",LOOKUP(H7,'[1]FP14 Pay Items'!$A$2:$A$8005,'[1]FP14 Pay Items'!$D$2:$D$8005))","v":"REMOVAL OF PAVEMENT, ASPHALT"},{"$f":"IF(ISBLANK(I7),\" \",LOOKUP(I7,'[1]FP14 Pay Items'!$A$2:$A$8005,'[1]FP14 Pay Items'!$D$2:$D$8005))","v":"ROADWAY AGGREGATE, METHOD 2"},{"$f":"IF(ISBLANK(J7),\" \",LOOKUP(J7,'[1]FP14 Pay Items'!$A$2:$A$8005,'[1]FP14 Pay Items'!$D$2:$D$8005))","v":"ASPHALT CONCRETE PAVEMENT, GYRATORY MIX, 3/4-INCH NOMINAL MAXIMUM SIZE AGGREGATE, 0.3 TO <3 MILLION ESAL"},{"$f":"IF(ISBLANK(K7),\" \",LOOKUP(K7,'[1]FP14 Pay Items'!$A$2:$A$8005,'[1]FP14 Pay Items'!$D$2:$D$8005))","v":"ANTISTRIP ADDITIVE, TYPE 3"},{"$f":"IF(ISBLANK(L7),\" \",LOOKUP(L7,'[1]FP14 Pay Items'!$A$2:$A$8005,'[1]FP14 Pay Items'!$D$2:$D$8005))","v":"FOG SEAL"},{"$f":"IF(ISBLANK(M7),\" \",LOOKUP(M7,'[1]FP14 Pay Items'!$A$2:$A$8005,'[1]FP14 Pay Items'!$D$2:$D$8005))","v":"PRIME COAT, METHOD 3"},{"$f":"IF(ISBLANK(N7),\" \",LOOKUP(N7,'[1]FP14 Pay Items'!$A$2:$A$8005,'[1]FP14 Pay Items'!$D$2:$D$8005))","v":"TACK COAT"}]
{"$rows_left_out":46}
{"sheet":"quantities report_secondary","index":6,"n_rows":0,"n_cols":0,"rows_kept":0,"cut":false,"hidden":false,"merged":[]}

{"sheet":"manual inputs_secondary","index":7,"n_rows":27,"n_cols":14,"rows_kept":27,"cut":false,"hidden":false,"merged":[[16,3,16,4],[17,3,17,4],[7,3,7,4],[8,3,8,4],[9,3,9,4],[10,3,10,4],[11,3,11,4],[12,3,12,4],[0,1,0,4],[13,3,13,4],[14,3,14,4],[15,3,15,4],[1,1,1,4],[2,3,2,4],[3,3,3,4],[4,3,4,4],[5,3,5,4],[6,3,6,4],[18,3,18,4],[19,3,19,4],[20,3,20,4],[21,3,21,4],[27,3,27,4]]}
[null,"Manually update any YELLOW cells"]
[null,"Conversion Factors",null,null,null,null,null,null,null,"Station Range",null,null,null,"Number of Rows"]
[null,"Material","Factor",null,null,null,null,null,"Add Starting Station",null,null,null,null,{"$f":"LOOKUP(2,1/('quantities report'!A:A<>\"\"),ROW('quantities report'!A:A))","v":{"$error":"#N/A"}}]
[null,"Aggregate Base",139,"lb/ft3"]
[null,"HACP",145.19999999999999,"lb/ft3"]
[null,"AntiStrip",0.01,null,null,null,null,null,null,null,null,null,null,"Aggregate Base"]
[null,"Prime Coat - Asphalt Cutbacks",0.33,"gal/yd2",null,null,null,null,null,null,null,null,null,"Asphalt Concrete Pavement"]
[null,"Prime Coat - Asphalt Cutbacks",251,"gal/ton",null,null,null,null,null,null,null,null,null,"N/A"]
{"$rows_left_out":20}
{"sheet":"Surfacing_secondary","index":8,"n_rows":33,"n_cols":27,"rows_kept":33,"cut":false,"hidden":false,"merged":[[5,24,5,26],[2,24,3,25],[4,2,4,4],[4,5,4,7],[4,8,4,10],[4,11,4,13],[4,14,4,16],[4,24,4,26],[5,2,5,4],[5,5,5,7],[5,8,5,10],[5,11,5,13],[5,14,5,16],[0,17,0,19],[1,0,1,1],[2,0,3,1],[2,2,3,3],[2,5,3,6],[2,8,3,9],[2,11,3,12],[2,14,3,15]]}
[null,null,null,null,null,null,null,null,null,null,null,null,null,null,null,null,null,"PAY COLUMNS",null,null,null,null,"(20% of area)"]
["TOTALS",null,{"$f":"SUM(C9:C33)","v":0},0,0,0,0,0,0,0,0,0,0,0,0,0,0,0,0,0,0,0,0,0,0,0,0]
["ORD Component Name",null,"XS_TC_Pavement Layer 1: ",null,{"$f":"VLOOKUP(C5,'manual inputs_secondary'!B2:E28,2,FALSE)","v":{"$error":"#N/A"}},"XS_TC_Pavement Layer 2: ",null,{"$f":"VLOOKUP(F5,'manual inputs_secondary'!$B$2:$E$28,2,FALSE)","v":{"$error":"#N/A"}},"XS_TC_Pavement Layer 3: ",null,{"$f":"VLOOKUP(I5,'manual inputs_secondary'!$B$2:$E$28,2,FALSE)","v":{"$error":"#N/A"}},"XS_TC_Pavement Layer 4: ",null,{"$f":"VLOOKUP(L5,'manual inputs_secondary'!$B$2:$E$28,2,FALSE)","v":139},"XS_TC_Pavement Layer 5: ",null,{"$f":"VLOOKUP(O5,'manual inputs_secondary'!$B$2:$E$28,2,FALSE)","v":{"$error":"#N/A"}},null,null,null,{"$f":"VLOOKUP(U5,'manual inputs_secondary'!$B$2:$E$28,2,FALSE)","v":0.1},{"$f":"VLOOKUP(V5,'manual inputs_secondary'!$B$2:$E$28,2,FALSE)","v":0.27},{"$f":"VLOOKUP(W5,'manual inputs_secondary'!$B$2:$E$28,2,FALSE)","v":14.75},{"$f":"VLOOKUP(X5,'manual inputs_secondary'!$B$2:$E$28,2,FALSE)","v":0.1},"Total Existing Pavement: ",null,{"$f":"VLOOKUP(Y5,'manual inputs_secondary'!$B$2:$E$28,2,FALSE)","v":4}]
[null,null,null,null,{"$f":"VLOOKUP(C5,'manual inputs_secondary'!B2:E270,3,FALSE)","v":{"$error":"#N/A"}},null,null,{"$f":"VLOOKUP(F5,'manual inputs_secondary'!$B$2:$E$28,3,FALSE)","v":{"$error":"#N/A"}},null,null,{"$f":"VLOOKUP(I5,'manual inputs_secondary'!$B$2:$E$28,3,FALSE)","v":{"$error":"#N/A"}},null,null,{"$f":"VLOOKUP(L5,'manual inputs_secondary'!$B$2:$E$28,3,FALSE)","v":"lb/ft3"},null,null,{"$f":"VLOOKUP(O5,'manual inputs_secondary'!$B$2:$E$28,3,FALSE)","v":{"$error":"#N/A"}},null,null,null,{"$f":"VLOOKUP(U5,'manual inputs_secondary'!$B$2:$E$28,3,FALSE)","v":"gal/yd2"},{"$f":"VLOOKUP(V5,'manual inputs_secondary'!$B$2:$E$28,3,FALSE)","v":"gal/yd2"},{"$f":"VLOOKUP(W5,'manual inputs_secondary'!$B$2:$E$28,3,FALSE)","v":"lb/yd2"},{"$f":"VLOOKUP(X5,'manual inputs_secondary'!$B$2:$E$28,3,FALSE)","v":"gal/yd2"},null,null,{"$f":"VLOOKUP(Y5,'manual inputs_secondary'!$B$2:$E$28,3,FALSE)","v":"inches"}]
[null,null,{"$f":"LOOKUP(C6,'manual inputs_secondary'!$B$23:$B$27,'manual inputs_secondary'!C23:C27)","v":"Asphalt Concrete Pavement"},null,null,{"$f":"LOOKUP(F6,'manual inputs_secondary'!$B$23:$B$27,'manual inputs_secondary'!C23:C27)","v":"N/A"},null,null,{"$f":"LOOKUP(I6,'manual inputs_secondary'!B23:B27,'manual inputs_secondary'!C23:C27)","v":"N/A"},null,null,{"$f":"LOOKUP(L6,'manual inputs_secondary'!B23:B27,'manual inputs_secondary'!C23:C27)","v":"Aggregate Base"},null,null,{"$f":"LOOKUP(O6,'manual inputs_secondary'!B23:B27,'manual inputs_secondary'!C23:C27)","v":"N/A"},null,null,"Total Aggregate Base","Total HACP","ANTISTRIP","Fog Seal - Asphalt Emulsion",{"$f":"IF('manual inputs_secondary'!C19=\"Asphalt Emulsion\",'manual inputs_secondary'!B9,'manual inputs_secondary'!B7)","v":"Prime Coat - Asphalt Emulsion"},"Blotter","Tack Coat - Asphalt Emulsion","Existing Pavement"]
[null,null,"Layer 1",null,null,"Layer 2",null,null,"Layer 3",null,null,"Layer 4",null,null,"Layer 5"]
[null,null,"CUYD","CUFT","TON","CUYD","CUFT","TON","CUYD","CUFT","TON","CUYD","CUFT","TON","CUYD","CUFT","TON","TON","TON","TON","TON","TON","TON","TON","CUYD","CUFT","SQYD"]
[null,{"$f":"IFERROR(INDEX('manual inputs_secondary'!J:J,SMALL(IF('manual inputs_secondary'!J:J<>\"\",ROW('manual inputs_secondary'!J:J)),ROW('manual inputs_secondary'!2:2))),\"\")","v":""}]
{"$rows_left_out":26}
{"sheet":"calc wrksht-rdwy exc Secondary","index":9,"n_rows":52,"n_cols":5,"rows_kept":52,"cut":false,"hidden":true,"merged":[[1,1,1,4]]}
[]
[null,"EARTHWORK SUMMARY\nUSING ROADWAY EXCAVATION AND EITHER BORROW OR WASTE PAY ITEMS"]
[]
[null,"EXCAVATION (unadjusted volumes)"]
[null,null,"Total Roadway Prism Excavation =",{"$f":"SUM(#REF!)","v":{"$error":"#REF!"}},"CUYD"]
[null,null,"Total Approach Road Prism Excavation =",{"$f":"#REF!","v":{"$error":"#REF!"}},"CUYD"]
[null,null,"Total Pay Item 20401-0000 Roadway Excavation =",{"$f":"SUM(D5:D6)","v":{"$error":"#REF!"}},"CUYD"]
[]
{"$rows_left_out":45}
{"sheet":"calc wrksht-emb const Secondary","index":10,"n_rows":52,"n_cols":5,"rows_kept":52,"cut":false,"hidden":true,"merged":[[1,1,1,4]]}
[]
[null,"EARTHWORK SUMMARY\nUSING EMBANKMENT CONSTRUCTION PAY ITEM"]
[]
[null,"EXCAVATION (unadjusted volumes)"]
[null,null,"Total Roadway Prism Excavation =",{"$f":"SUM(#REF!)","v":{"$error":"#REF!"}},"CUYD"]
[null,null,"Total Approach Road Prism Excavation =",{"$f":"#REF!","v":{"$error":"#REF!"}},"CUYD"]
[null,null,"Total =",{"$f":"SUM(D5:D6)","v":{"$error":"#REF!"}},"CUYD"]
[]
{"$rows_left_out":44}