{"text_format":"1","workbook":"xlsx","n_sheets":22,"sheets":["Instructions","quantities report","Totals - QA_QC","manual inputs","Grading","Removals","Structure_Ex","Backfill","calc wrksht-rdwy exc pay item","Grading Summary - rdwy exc","calc wrksht-emb const pay item","Grading Summary - emb const","Conserved Topsoil Summary","Conserved EX Pave Summary","quantities report_secondary","manual inputs_secondary","Grading_secondary","Removals_Secondary","Structure_Ex_Secondary","Backfill_Secondary","calc wrksht-rdwy exc Secondary","calc wrksht-emb const Secondary"],"not_rendered":{"charts":0,"images":5,"macros":1,"external_links":1,"defined_names":4,"comments":0,"pivot_tables":0},"unopened":[],"bounds":{"document_bytes":16777216,"sheet_cells":100000,"rows_first":2000,"rows_last":500,"rows_between":2000,"halvings":0,"cell_chars":16384,"cell_head_chars":4096},"cells_cut":0,"cells_raw":0,"read":"whole","date_system":"1900"}

{"sheet":"Instructions","index":0,"n_rows":43,"n_cols":3,"rows_kept":43,"cut":false,"hidden":false,"merged":[[1,1,1,2],[36,2,40,2],[7,2,29,2]]}
[" "]
[null,"Instructions:"]
[null,1,"Add cut and fill volumes to the corridor"]
[null,2,"Run Quantities by Named boundary report and save file in excel format."]
[null,3,"Select the volumes report"]
[]
[null,4,"The report should be in the following format:"]
[]
[]
[]
[]
[]
[]
[]
[]
[]
[]
[]
[]
[]
[]
[]
[]
[]
[]
[]
[]
[]
[]
[]
[null,5,"Right click on the report in ORD and select Export to Excel"]
[]
[null,6,"Select entire sheet in the volumes excel spreadsheet.  (CTRL-A or select the select all button)"]
[null,7,"Paste data in the quantities report tab in the grading summary spreadsheet."]
[null,8,"Select the rows that contain the whole project totals and cut and paste to the Totals - QA_QC tab."]
[null,9,"Go to the \"Manual Inputs\" page and click on the \"Click Here to Format Worksheet\" button."]
[]
[]
[]
[]
[]
[null,9,"Determine if it is an excavation or embankment job and fill out the appropriate table."]
[null,10,"For major secondary roads use the secondary report tabs."]

{"sheet":"quantities report","index":1,"n_rows":0,"n_cols":0,"rows_kept":0,"cut":false,"hidden":false,"merged":[]}

{"sheet":"Totals - QA_QC","index":2,"n_rows":0,"n_cols":0,"rows_kept":0,"cut":false,"hidden":false,"merged":[]}

{"sheet":"manual inputs","index":3,"n_rows":39,"n_cols":13,"rows_kept":39,"cut":false,"hidden":false,"merged":[[22,1,22,3]]}
[]
[null,"Shrink/Swell Factor Summary",null,null,null,"Various Backfill Material Generated Onsite",null,null,"Number of Rows",null,null,null,"Station Range"]
[null,"Begin Station","End Station","Factor",null,"Place an 'x' in the row for any backfill material that is expected to be generated from onsite excavation.",null,null,{"$f":"LOOKUP(2,1/('quantities report'!A:A<>\"\"),ROW('quantities report'!A:A))","v":{"$error":"#N/A"}},null,null,"Add Starting Station"]
[null,null,null,null,null,"If the material below is expected to be imported because there is not any material from onsite that will meet the material quality requirements, leave the row blank."]
[]
[null,null,null,null,null,"………………..Verify with Geotech and Materials……………….."]
[null,{"$f":"IFERROR(INDEX('manual inputs'!M:M,SMALL(IF(#REF!<>\"\",ROW(#REF!)),ROW(8:8))),\"\")","v":""},null,null,null,"Material Type","Typical Uses","Generated from Onsite Material?"]
[]
[]
[null,null,null,null,null,"Wall Backfill","MSE Wall, SMSE Wall, Rockery, Concrete Retaining Wall with Parapet"]
[]
[null,null,null,null,null,"Foundation Fill","MSE Wall, SMSE Wall, Rockery, Concrete Cut Wall, Concrete Retaining Wall with Parapet, Concrete Fill Wall"]
[]
[]
[null,null,null,null,null,"Select Wall Backfill","MSE Wall, SMSE Wall, GFMSE Wall"]
[]
[null,null,null,null,null,"Rock","Rockery"]
[]
[null,null,null,null,null,"Granular Rock Backdrain","Rockery"]
[]
[null,null,null,null,null,"Structural Backfill","Guardwall, Concrete Cut Wall, Concrete Retaining Wall with Parapet, Concrete Fill Wall"]
[]
[null,"Note:  Do not use '+' sign in begin and end stations above",null,null,null,"Backfill Material","Guardwall, Concrete Retaining Wall with Parapet, Soil Nail Wall"]
[]
[null,null,null,null,null,"Granular Backfill","GFMSE Wall"]
[]
[]
[null,null,null,null,null,"Subex Backfill","Volume may be calculated by\n a. GEOPAK, \n b. Input by hand, or\n c. Both GEOPAK and hand calculations"]
[]
[]
[null,null,null,null,null,"Aggregate Base","Volume not generated by GEOPAK - input by hand."]
[]
[null,null,null,null,null,"Riprap","Volume not generated by GEOPAK - input by hand."]
[]
[null,null,null,null,null,"Special Rock Embankment","Volume not generated by GEOPAK - input by hand."]
[]
[null,null,null,null,null,"Embankment for Roadway Obliteration","Volume not generated by GEOPAK - input by hand."]
[]
[null,null,null,null,null,"Topping or Select Topping","Volume not generated by GEOPAK - input by hand."]

{"sheet":"Grading","index":4,"n_rows":32,"n_cols":42,"rows_kept":32,"cut":false,"hidden":false,"merged":[[3,39,4,39],[3,40,4,40],[3,41,4,41],[3,34,4,34],[3,35,4,35],[3,36,4,36],[3,37,4,37],[3,38,4,38],[3,18,3,33],[3,12,5,12],[3,13,5,13],[3,2,3,4],[3,6,3,8],[3,9,3,11],[3,14,3,17]]}
[null,null,null,null,null,"Pay Column",null,null,null,null,null,null,null,null,null,null,null,"Pay Column"]
[]
["TOTALS",null,{"$f":"SUM(C8:C32)","v":0},{"$f":"SUM(D8:D32)","v":0},{"$f":"SUM(E8:E32)","v":0},{"$f":"SUM(F8:F32)","v":0},{"$f":"SUM(G8:G32)","v":0},0,0,0,0,0,null,{"$f":"SUM(N8:N32)","v":0},{"$f":"SUM(O8:O32)","v":0},{"$f":"SUM(P8:P32)","v":0},{"$f":"SUM(Q8:Q32)","v":0},{"$f":"SUM(R8:R32)","v":0},{"$f":"SUM(S8:S32)","v":0},0,0,0,0,0,0,0,0,0,0,0,0,0,0,0,{"$f":"SUM(AI8:AI32)","v":0},{"$f":"SUM(AJ7:AJ186)","v":0},{"$f":"SUM(AK7:AK186)","v":0},{"$f":"SUM(AL7:AL186)","v":0},{"$f":"SUM(AM7:AM186)","v":0},{"$f":"AVERAGE(AN8:AN186)","v":0.8999999999999998},{"$f":"SUM(AO7:AO186)","v":0}]
[null,null,"Excavation",null,null,"Total","Excavation Material Available for Fill",null,null,"Excavation Material Unavailable for Fills",null,null,"Shrink/Swell Factor","Total Excavation Available for Fills","Embankment",null,null,null,"Needed Volume for Backfill Generated on Site",null,null,null,null,null,null,null,null,null,null,null,null,null,null,null,"Total Embankment","Excavation \n-\nEmbankment","Waste","Embankment Construction","Unclassifed Borrow Required","Unclassified Borrow Shrink/Swell","Unclassified Borrow","Mass Ordinate"]
[null,null,"Roadway prism minus topsoil and pavement","Total Excavation\nVolumes_Cut+Existing_Payment (not replaced)+Topsoil","Approach Road","Total Excavation for Pay","(+)\nStructure Excavation (Walls)","(+)\nExcavation\nFrom\nRoadway\nObliteration","(+)\nSubexcavation","(-)\nPavement Removal in Cuts","(-)\nTopsoil Stripping in Cuts","(-)\nDisposal of Subexcavation Material",null,null,"Roadway Prism (Embankment) plus backfill for topsoil in fills and existing pavment in fills\n","Total Roadway Prism Fill","Approach Road","Total Roadway Prism Fill for Pay","(+)\nWall Backfill","(+)\nFoundation\nFill","(+)\nSelect Wall\nBackfill","(+)\nRock","(+)\nGranular\nRock Backdrain","(+)\nStructural Backfill","(+)\nBackfill\nMaterial","(+)\nGranular\nBackfill","\nBackfill for Pavement Removal Under Fill","\nTopsoil Replacement Under Fill","(+)\nSub-excavation","(+)\nAggregate Base","(+)\nRiprap","(+)\nSpecial Rock Embankment","(+)\nEmbankment For Roadway Obliteration","(+)\nTopping"]
["ORD Component Name",null,"Volumes_Cut: ","Total Excavation","--","Total Excavation for Pay","--","--","XS_TC_Subex_Exc2: ","CFL Exist Pvmt (removed): ","CFL Exist Topsoil (removed): ","XS_TC_Subex_Exc2: ",null,null,"Volumes_Fill: ",null,"--","Total Embankment for Pay","--","--","XS_TC_MSE Wall Backfill 2: ","XS_TC_Rockery Wall Backfill 2: ","XS_TC_Rockery Wall Back: ","XS_TC_Wall Backfill: ","--","Need gabion faced MSE component","CFL Exist Pvmt (removed and replaced): ","CFL Exist Topsoil (removed and replaced): ","XS_TC_Subex_Backfill1: "]
["Enter Start of Project",{"$f":"IFERROR(INDEX('manual inputs'!M:M,SMALL(IF('manual inputs'!M:M<>\"\",ROW('manual inputs'!M:M)),ROW(2:2))),\"\")","v":""}]
[null,{"$f":"IFERROR(INDEX('manual inputs'!M:M,SMALL(IF('manual inputs'!M:M<>\"\",ROW('manual inputs'!M:M)),ROW(3:3))),\"\")","v":""},{"$f":"IF(B8=\"\",\"\",IFERROR(INDEX('quantities report'!$D$2:$D$10003,SMALL(IF('quantities report'!$A$2:$A$10003=C$6,ROW('quantities report'!$A$2:$A$10003)-1,\"\"),ROWS($B$8:$B8))),\"0\"))","v":""},{"$f":"IF(B8=\"\",\"\",$C8+$J8+$K8)","v":""},null,{"$f":"IF(B8=\"\",\"\",$D8+$E8)","v":""},{"$f":"IF($B8=\"\",\"\",Structure_Ex!I8)","v":""},null,{"$f":"IF($B8=\"\",\"\",IFERROR(INDEX('quantities report'!$D$2:$D$10003,SMALL(IF('quantities report'!$A$2:$A$10003=I$6,ROW('quantities report'!$A$2:$A$10003)-1,\"\"),ROWS($B$8:$B8))),\"0\"))","v":""},{"$f":"IF($B8=\"\",\"\",Removals!$F5)","v":""},{"$f":"IF($B8=\"\",\"\",Removals!$K5)","v":""},{"$f":"IF($B8=\"\",\"\",IFERROR(INDEX('quantities report'!$D$2:$D$10003,SMALL(IF('quantities report'!$A$2:$A$10003=L$6,ROW('quantities report'!$A$2:$A$10003)-1,\"\"),ROWS($B$8:$B8))),\"0\"))","v":""},{"$f":"IF(B8=\"\",\"\",LOOKUP(B8,'manual inputs'!$B$4:$B$22,'manual inputs'!$D$4:$D$22))","v":""},{"$f":"IF(B8 =\"\",\"\",(($F8+$G8+$H8+$I8-$J8-$K8-$L8)*$M8))","v":""},{"$f":"IF($B8=\"\",\"\",IFERROR(INDEX('quantities report'!$D$2:$D$10003,SMALL(IF('quantities report'!$A$2:$A$10003=O$6,ROW('quantities report'!$A$2:$A$10003)-1,\"\"),ROWS($B$8:$B8))),\"0\"))","v":""},{"$f":"IF(B8=\"\",\"\",$O8-$AA8-$AB8)","v":""},null,{"$f":"IF(D8=\"\",\"\",$O8-$AA8-$AB8+$Q8)","v":""},{"$f":"IF($B8=\"\",\"\",Backfill!E8)","v":""},{"$f":"IF($B8=\"\",\"\",Backfill!H8)","v":""},{"$f":"IF($B8=\"\",\"\",IFERROR(INDEX('quantities report'!$D$2:$D$10003,SMALL(IF('quantities report'!$A$2:$A$10003=U$6,ROW('quantities report'!$A$2:$A$10003)-1,\"\"),ROWS($B$8:$B8))),\"0\"))","v":""},{"$f":"IF($B8=\"\",\"\",IFERROR(INDEX('quantities report'!$D$2:$D$10003,SMALL(IF('quantities report'!$A$2:$A$10003=V$6,ROW('quantities report'!$A$2:$A$10003)-1,\"\"),ROWS($B$8:$B8))),\"0\"))","v":""},{"$f":"IF($B8=\"\",\"\",IFERROR(INDEX('quantities report'!$D$2:$D$10003,SMALL(IF('quantities report'!$A$2:$A$10003=W$6,ROW('quantities report'!$A$2:$A$10003)-1,\"\"),ROWS($B$8:$B8))),\"0\"))","v":""},{"$f":"IF($B8=\"\",\"\",IFERROR(INDEX('quantities report'!$D$2:$D$10003,SMALL(IF('quantities report'!$A$2:$A$10003=X$6,ROW('quantities report'!$A$2:$A$10003)-1,\"\"),ROWS($B$8:$B8))),\"0\"))","v":""},{"$f":"IF($B8=\"\",\"\",Backfill!P8)","v":""},{"$f":"IF($B8=\"\",\"\",IFERROR(INDEX('quantities report'!$D$2:$D$10003,SMALL(IF('quantities report'!$A$2:$A$10003=Z$6,ROW('quantities report'!$A$2:$A$10003)-1,\"\"),ROWS($B$8:$B8))),\"0\"))","v":""},{"$f":"IF($B8=\"\",\"\",Removals!$G5)","v":""},{"$f":"IF($B8=\"\",\"\",Removals!$L5)","v":""},{"$f":"IF($B8=\"\",\"\",IFERROR(INDEX('quantities report'!$D$2:$D$10003,SMALL(IF('quantities report'!$A$2:$A$10003=AC$6,ROW('quantities report'!$A$2:$A$10003)-1,\"\"),ROWS($B$8:$B8))),\"0\"))","v":""},{"$f":"IF($B8=\"\",\"\",IFERROR(INDEX('quantities report'!$D$2:$D$10003,SMALL(IF('quantities report'!$A$2:$A$10003=AD$6,ROW('quantities report'!$A$2:$A$10003)-1,\"\"),ROWS($B$8:$B8))),\"0\"))","v":""},{"$f":"IF($B8=\"\",\"\",IFERROR(INDEX('quantities report'!$D$2:$D$10003,SMALL(IF('quantities report'!$A$2:$A$10003=AE$6,ROW('quantities report'!$A$2:$A$10003)-1,\"\"),ROWS($B$8:$B8))),\"0\"))","v":""},{"$f":"IF($B8=\"\",\"\",IFERROR(INDEX('quantities report'!$D$2:$D$10003,SMALL(IF('quantities report'!$A$2:$A$10003=AF$6,ROW('quantities report'!$A$2:$A$10003)-1,\"\"),ROWS($B$8:$B8))),\"0\"))","v":""},{"$f":"IF($B8=\"\",\"\",IFERROR(INDEX('quantities report'!$D$2:$D$10003,SMALL(IF('quantities report'!$A$2:$A$10003=AG$6,ROW('quantities report'!$A$2:$A$10003)-1,\"\"),ROWS($B$8:$B8))),\"0\"))","v":""},{"$f":"IF($B8=\"\",\"\",IFERROR(INDEX('quantities report'!$D$2:$D$10003,SMALL(IF('quantities report'!$A$2:$A$10003=AH$6,ROW('quantities report'!$A$2:$A$10003)-1,\"\"),ROWS($B$8:$B8))),\"0\"))","v":""},{"$f":"IF(B8=\"\",\"\",$O8+$Q8+$S8+$T8+$U8+$V8+$W8+$X8+$Y8+$Z8+$AC8+$AD8+$AE8+$AF8+$AG8+$AH8)","v":""},{"$f":"IF(B8=\"\",\"\",$N8-$AI8)","v":""},{"$f":"IF(B8=\"\",\"\",$AJ8)","v":""},{"$f":"IF(B8=\"\",\"\",$O8+$Q8)","v":""},{"$f":"IF(B8=\"\",\"\",-$AJ8)","v":""},0.9,{"$f":"IF(B8=\"\",\"\",AM8/AN8)","v":""},{"$f":"AJ8","v":""}]
[null,{"$f":"IFERROR(INDEX('manual inputs'!M:M,SMALL(IF('manual inputs'!M:M<>\"\",ROW('manual inputs'!M:M)),ROW(4:4))),\"\")","v":""},{"$f":"IF(B9=\"\",\"\",IFERROR(INDEX('quantities report'!$D$2:$D$10003,SMALL(IF('quantities report'!$A$2:$A$10003=C$6,ROW('quantities report'!$A$2:$A$10003)-1,\"\"),ROWS($B$8:$B9))),\"0\"))","v":""},{"$f":"IF(B9=\"\",\"\",$C9+$J9+$K9)","v":""},null,{"$f":"IF(B9=\"\",\"\",$D9+$E9)","v":""},{"$f":"IF($B9=\"\",\"\",Structure_Ex!I9)","v":""},null,{"$f":"IF($B9=\"\",\"\",IFERROR(INDEX('quantities report'!$D$2:$D$10003,SMALL(IF('quantities report'!$A$2:$A$10003=I$6,ROW('quantities report'!$A$2:$A$10003)-1,\"\"),ROWS($B$8:$B9))),\"0\"))","v":""},{"$f":"IF($B9=\"\",\"\",Removals!$F6)","v":""},{"$f":"IF($B9=\"\",\"\",Removals!$K6)","v":""},{"$f":"IF($B9=\"\",\"\",IFERROR(INDEX('quantities report'!$D$2:$D$10003,SMALL(IF('quantities report'!$A$2:$A$10003=L$6,ROW('quantities report'!$A$2:$A$10003)-1,\"\"),ROWS($B$8:$B9))),\"0\"))","v":""},{"$f":"IF(B9=\"\",\"\",LOOKUP(B9,'manual inputs'!$B$4:$B$22,'manual inputs'!$D$4:$D$22))","v":""},"",{"$f":"IF($B9=\"\",\"\",IFERROR(INDEX('quantities report'!$D$2:$D$10003,SMALL(IF('quantities report'!$A$2:$A$10003=O$6,ROW('quantities report'!$A$2:$A$10003)-1,\"\"),ROWS($B$8:$B9))),\"0\"))","v":""},"",null,{"$f":"IF(D9=\"\",\"\",$O9-$AA9-$AB9+$Q9)","v":""},{"$f":"IF($B9=\"\",\"\",IFERROR(INDEX('quantities report'!$D$2:$D$10003,SMALL(IF('quantities report'!$A$2:$A$10003=S$6,ROW('quantities report'!$A$2:$A$10003)-1,\"\"),ROWS($B$8:$B9))),\"0\"))","v":""},{"$f":"IF($B9=\"\",\"\",IFERROR(INDEX('quantities report'!$D$2:$D$10003,SMALL(IF('quantities report'!$A$2:$A$10003=T$6,ROW('quantities report'!$A$2:$A$10003)-1,\"\"),ROWS($B$8:$B9))),\"0\"))","v":""},{"$f":"IF($B9=\"\",\"\",IFERROR(INDEX('quantities report'!$D$2:$D$10003,SMALL(IF('quantities report'!$A$2:$A$10003=U$6,ROW('quantities report'!$A$2:$A$10003)-1,\"\"),ROWS($B$8:$B9))),\"0\"))","v":""},{"$f":"IF($B9=\"\",\"\",IFERROR(INDEX('quantities report'!$D$2:$D$10003,SMALL(IF('quantities report'!$A$2:$A$10003=V$6,ROW('quantities report'!$A$2:$A$10003)-1,\"\"),ROWS($B$8:$B9))),\"0\"))","v":""},{"$f":"IF($B9=\"\",\"\",IFERROR(INDEX('quantities report'!$D$2:$D$10003,SMALL(IF('quantities report'!$A$2:$A$10003=W$6,ROW('quantities report'!$A$2:$A$10003)-1,\"\"),ROWS($B$8:$B9))),\"0\"))","v":""},{"$f":"IF($B9=\"\",\"\",IFERROR(INDEX('quantities report'!$D$2:$D$10003,SMALL(IF('quantities report'!$A$2:$A$10003=X$6,ROW('quantities report'!$A$2:$A$10003)-1,\"\"),ROWS($B$8:$B9))),\"0\"))","v":""},{"$f":"IF($B9=\"\",\"\",IFERROR(INDEX('quantities report'!$D$2:$D$10003,SMALL(IF('quantities report'!$A$2:$A$10003=Y$6,ROW('quantities report'!$A$2:$A$10003)-1,\"\"),ROWS($B$8:$B9))),\"0\"))","v":""},{"$f":"IF($B9=\"\",\"\",IFERROR(INDEX('quantities report'!$D$2:$D$10003,SMALL(IF('quantities report'!$A$2:$A$10003=Z$6,ROW('quantities report'!$A$2:$A$10003)-1,\"\"),ROWS($B$8:$B9))),\"0\"))","v":""},{"$f":"IF($B9=\"\",\"\",Removals!$G6)","v":""},{"$f":"IF($B9=\"\",\"\",Removals!$L6)","v":""},{"$f":"IF($B9=\"\",\"\",IFERROR(INDEX('quantities report'!$D$2:$D$10003,SMALL(IF('quantities report'!$A$2:$A$10003=AC$6,ROW('quantities report'!$A$2:$A$10003)-1,\"\"),ROWS($B$8:$B9))),\"0\"))","v":""},{"$f":"IF($B9=\"\",\"\",IFERROR(INDEX('quantities report'!$D$2:$D$10003,SMALL(IF('quantities report'!$A$2:$A$10003=AD$6,ROW('quantities report'!$A$2:$A$10003)-1,\"\"),ROWS($B$8:$B9))),\"0\"))","v":""},{"$f":"IF($B9=\"\",\"\",IFERROR(INDEX('quantities report'!$D$2:$D$10003,SMALL(IF('quantities report'!$A$2:$A$10003=AE$6,ROW('quantities report'!$A$2:$A$10003)-1,\"\"),ROWS($B$8:$B9))),\"0\"))","v":""},{"$f":"IF($B9=\"\",\"\",IFERROR(INDEX('quantities report'!$D$2:$D$10003,SMALL(IF('quantities report'!$A$2:$A$10003=AF$6,ROW('quantities report'!$A$2:$A$10003)-1,\"\"),ROWS($B$8:$B9))),\"0\"))","v":""},{"$f":"IF($B9=\"\",\"\",IFERROR(INDEX('quantities report'!$D$2:$D$10003,SMALL(IF('quantities report'!$A$2:$A$10003=AG$6,ROW('quantities report'!$A$2:$A$10003)-1,\"\"),ROWS($B$8:$B9))),\"0\"))","v":""},{"$f":"IF($B9=\"\",\"\",IFERROR(INDEX('quantities report'!$D$2:$D$10003,SMALL(IF('quantities report'!$A$2:$A$10003=AH$6,ROW('quantities report'!$A$2:$A$10003)-1,\"\"),ROWS($B$8:$B9))),\"0\"))","v":""},"","","","","",0.9,"",{"$f":"AJ9","v":""}]
[null,{"$f":"IFERROR(INDEX('manual inputs'!M:M,SMALL(IF('manual inputs'!M:M<>\"\",ROW('manual inputs'!M:M)),ROW(5:5))),\"\")","v":""},{"$f":"IF(B10=\"\",\"\",IFERROR(INDEX('quantities report'!$D$2:$D$10003,SMALL(IF('quantities report'!$A$2:$A$10003=C$6,ROW('quantities report'!$A$2:$A$10003)-1,\"\"),ROWS($B$8:$B10))),\"0\"))","v":""},"",null,"",{"$f":"IF($B10=\"\",\"\",Structure_Ex!I10)","v":""},null,{"$f":"IF($B10=\"\",\"\",IFERROR(INDEX('quantities report'!$D$2:$D$10003,SMALL(IF('quantities report'!$A$2:$A$10003=I$6,ROW('quantities report'!$A$2:$A$10003)-1,\"\"),ROWS($B$8:$B10))),\"0\"))","v":""},{"$f":"IF($B10=\"\",\"\",Removals!$F7)","v":""},{"$f":"IF($B10=\"\",\"\",Removals!$K7)","v":""},{"$f":"IF($B10=\"\",\"\",IFERROR(INDEX('quantities report'!$D$2:$D$10003,SMALL(IF('quantities report'!$A$2:$A$10003=L$6,ROW('quantities report'!$A$2:$A$10003)-1,\"\"),ROWS($B$8:$B10))),\"0\"))","v":""},{"$f":"IF(B10=\"\",\"\",LOOKUP(B10,'manual inputs'!$B$4:$B$22,'manual inputs'!$D$4:$D$22))","v":""},"",{"$f":"IF($B10=\"\",\"\",IFERROR(INDEX('quantities report'!$D$2:$D$10003,SMALL(IF('quantities report'!$A$2:$A$10003=O$6,ROW('quantities report'!$A$2:$A$10003)-1,\"\"),ROWS($B$8:$B10))),\"0\"))","v":""},"",null,"",{"$f":"IF($B10=\"\",\"\",IFERROR(INDEX('quantities report'!$D$2:$D$10003,SMALL(IF('quantities report'!$A$2:$A$10003=S$6,ROW('quantities report'!$A$2:$A$10003)-1,\"\"),ROWS($B$8:$B10))),\"0\"))","v":""},{"$f":"IF($B10=\"\",\"\",IFERROR(INDEX('quantities report'!$D$2:$D$10003,SMALL(IF('quantities report'!$A$2:$A$10003=T$6,ROW('quantities report'!$A$2:$A$10003)-1,\"\"),ROWS($B$8:$B10))),\"0\"))","v":""},{"$f":"IF($B10=\"\",\"\",IFERROR(INDEX('quantities report'!$D$2:$D$10003,SMALL(IF('quantities report'!$A$2:$A$10003=U$6,ROW('quantities report'!$A$2:$A$10003)-1,\"\"),ROWS($B$8:$B10))),\"0\"))","v":""},{"$f":"IF($B10=\"\",\"\",IFERROR(INDEX('quantities report'!$D$2:$D$10003,SMALL(IF('quantities report'!$A$2:$A$10003=V$6,ROW('quantities report'!$A$2:$A$10003)-1,\"\"),ROWS($B$8:$B10))),\"0\"))","v":""},{"$f":"IF($B10=\"\",\"\",IFERROR(INDEX('quantities report'!$D$2:$D$10003,SMALL(IF('quantities report'!$A$2:$A$10003=W$6,ROW('quantities report'!$A$2:$A$10003)-1,\"\"),ROWS($B$8:$B10))),\"0\"))","v":""},{"$f":"IF($B10=\"\",\"\",IFERROR(INDEX('quantities report'!$D$2:$D$10003,SMALL(IF('quantities report'!$A$2:$A$10003=X$6,ROW('quantities report'!$A$2:$A$10003)-1,\"\"),ROWS($B$8:$B10))),\"0\"))","v":""},{"$f":"IF($B10=\"\",\"\",IFERROR(INDEX('quantities report'!$D$2:$D$10003,SMALL(IF('quantities report'!$A$2:$A$10003=Y$6,ROW('quantities report'!$A$2:$A$10003)-1,\"\"),ROWS($B$8:$B10))),\"0\"))","v":""},{"$f":"IF($B10=\"\",\"\",IFERROR(INDEX('quantities report'!$D$2:$D$10003,SMALL(IF('quantities report'!$A$2:$A$10003=Z$6,ROW('quantities report'!$A$2:$A$10003)-1,\"\"),ROWS($B$8:$B10))),\"0\"))","v":""},{"$f":"IF($B10=\"\",\"\",Removals!$G7)","v":""},{"$f":"IF($B10=\"\",\"\",Removals!$L7)","v":""},{"$f":"IF($B10=\"\",\"\",IFERROR(INDEX('quantities report'!$D$2:$D$10003,SMALL(IF('quantities report'!$A$2:$A$10003=AC$6,ROW('quantities report'!$A$2:$A$10003)-1,\"\"),ROWS($B$8:$B10))),\"0\"))","v":""},{"$f":"IF($B10=\"\",\"\",IFERROR(INDEX('quantities report'!$D$2:$D$10003,SMALL(IF('quantities report'!$A$2:$A$10003=AD$6,ROW('quantities report'!$A$2:$A$10003)-1,\"\"),ROWS($B$8:$B10))),\"0\"))","v":""},{"$f":"IF($B10=\"\",\"\",IFERROR(INDEX('quantities report'!$D$2:$D$10003,SMALL(IF('quantities report'!$A$2:$A$10003=AE$6,ROW('quantities report'!$A$2:$A$10003)-1,\"\"),ROWS($B$8:$B10))),\"0\"))","v":""},{"$f":"IF($B10=\"\",\"\",IFERROR(INDEX('quantities report'!$D$2:$D$10003,SMALL(IF('quantities report'!$A$2:$A$10003=AF$6,ROW('quantities report'!$A$2:$A$10003)-1,\"\"),ROWS($B$8:$B10))),\"0\"))","v":""},{"$f":"IF($B10=\"\",\"\",IFERROR(INDEX('quantities report'!$D$2:$D$10003,SMALL(IF('quantities report'!$A$2:$A$10003=AG$6,ROW('quantities report'!$A$2:$A$10003)-1,\"\"),ROWS($B$8:$B10))),\"0\"))","v":""},{"$f":"IF($B10=\"\",\"\",IFERROR(INDEX('quantities report'!$D$2:$D$10003,SMALL(IF('quantities report'!$A$2:$A$10003=AH$6,ROW('quantities report'!$A$2:$A$10003)-1,\"\"),ROWS($B$8:$B10))),\"0\"))","v":""},"","","","","",0.9,"",""]
[null,{"$f":"IFERROR(INDEX('manual inputs'!M:M,SMALL(IF('manual inputs'!M:M<>\"\",ROW('manual inputs'!M:M)),ROW(6:6))),\"\")","v":""},{"$f":"IF(B11=\"\",\"\",IFERROR(INDEX('quantities report'!$D$2:$D$10003,SMALL(IF('quantities report'!$A$2:$A$10003=C$6,ROW('quantities report'!$A$2:$A$10003)-1,\"\"),ROWS($B$8:$B11))),\"0\"))","v":""},"",null,"",{"$f":"IF($B11=\"\",\"\",Structure_Ex!I11)","v":""},null,{"$f":"IF($B11=\"\",\"\",IFERROR(INDEX('quantities report'!$D$2:$D$10003,SMALL(IF('quantities report'!$A$2:$A$10003=I$6,ROW('quantities report'!$A$2:$A$10003)-1,\"\"),ROWS($B$8:$B11))),\"0\"))","v":""},{"$f":"IF($B11=\"\",\"\",Removals!$F8)","v":""},{"$f":"IF($B11=\"\",\"\",Removals!$K8)","v":""},{"$f":"IF($B11=\"\",\"\",IFERROR(INDEX('quantities report'!$D$2:$D$10003,SMALL(IF('quantities report'!$A$2:$A$10003=L$6,ROW('quantities report'!$A$2:$A$10003)-1,\"\"),ROWS($B$8:$B11))),\"0\"))","v":""},{"$f":"IF(B11=\"\",\"\",LOOKUP(B11,'manual inputs'!$B$4:$B$22,'manual inputs'!$D$4:$D$22))","v":""},"",{"$f":"IF($B11=\"\",\"\",IFERROR(INDEX('quantities report'!$D$2:$D$10003,SMALL(IF('quantities report'!$A$2:$A$10003=O$6,ROW('quantities report'!$A$2:$A$10003)-1,\"\"),ROWS($B$8:$B11))),\"0\"))","v":""},"",null,"",{"$f":"IF($B11=\"\",\"\",IFERROR(INDEX('quantities report'!$D$2:$D$10003,SMALL(IF('quantities report'!$A$2:$A$10003=S$6,ROW('quantities report'!$A$2:$A$10003)-1,\"\"),ROWS($B$8:$B11))),\"0\"))","v":""},{"$f":"IF($B11=\"\",\"\",IFERROR(INDEX('quantities report'!$D$2:$D$10003,SMALL(IF('quantities report'!$A$2:$A$10003=T$6,ROW('quantities report'!$A$2:$A$10003)-1,\"\"),ROWS($B$8:$B11))),\"0\"))","v":""},{"$f":"IF($B11=\"\",\"\",IFERROR(INDEX('quantities report'!$D$2:$D$10003,SMALL(IF('quantities report'!$A$2:$A$10003=U$6,ROW('quantities report'!$A$2:$A$10003)-1,\"\"),ROWS($B$8:$B11))),\"0\"))","v":""},{"$f":"IF($B11=\"\",\"\",IFERROR(INDEX('quantities report'!$D$2:$D$10003,SMALL(IF('quantities report'!$A$2:$A$10003=V$6,ROW('quantities report'!$A$2:$A$10003)-1,\"\"),ROWS($B$8:$B11))),\"0\"))","v":""},{"$f":"IF($B11=\"\",\"\",IFERROR(INDEX('quantities report'!$D$2:$D$10003,SMALL(IF('quantities report'!$A$2:$A$10003=W$6,ROW('quantities report'!$A$2:$A$10003)-1,\"\"),ROWS($B$8:$B11))),\"0\"))","v":""},{"$f":"IF($B11=\"\",\"\",IFERROR(INDEX('quantities report'!$D$2:$D$10003,SMALL(IF('quantities report'!$A$2:$A$10003=X$6,ROW('quantities report'!$A$2:$A$10003)-1,\"\"),ROWS($B$8:$B11))),\"0\"))","v":""},{"$f":"IF($B11=\"\",\"\",IFERROR(INDEX('quantities report'!$D$2:$D$10003,SMALL(IF('quantities report'!$A$2:$A$10003=Y$6,ROW('quantities report'!$A$2:$A$10003)-1,\"\"),ROWS($B$8:$B11))),\"0\"))","v":""},{"$f":"IF($B11=\"\",\"\",IFERROR(INDEX('quantities report'!$D$2:$D$10003,SMALL(IF('quantities report'!$A$2:$A$10003=Z$6,ROW('quantities report'!$A$2:$A$10003)-1,\"\"),ROWS($B$8:$B11))),\"0\"))","v":""},{"$f":"IF($B11=\"\",\"\",Removals!$G8)","v":""},{"$f":"IF($B11=\"\",\"\",Removals!$L8)","v":""},{"$f":"IF($B11=\"\",\"\",IFERROR(INDEX('quantities report'!$D$2:$D$10003,SMALL(IF('quantities report'!$A$2:$A$10003=AC$6,ROW('quantities report'!$A$2:$A$10003)-1,\"\"),ROWS($B$8:$B11))),\"0\"))","v":""},{"$f":"IF($B11=\"\",\"\",IFERROR(INDEX('quantities report'!$D$2:$D$10003,SMALL(IF('quantities report'!$A$2:$A$10003=AD$6,ROW('quantities report'!$A$2:$A$10003)-1,\"\"),ROWS($B$8:$B11))),\"0\"))","v":""},{"$f":"IF($B11=\"\",\"\",IFERROR(INDEX('quantities report'!$D$2:$D$10003,SMALL(IF('quantities report'!$A$2:$A$10003=AE$6,ROW('quantities report'!$A$2:$A$10003)-1,\"\"),ROWS($B$8:$B11))),\"0\"))","v":""},{"$f":"IF($B11=\"\",\"\",IFERROR(INDEX('quantities report'!$D$2:$D$10003,SMALL(IF('quantities report'!$A$2:$A$10003=AF$6,ROW('quantities report'!$A$2:$A$10003)-1,\"\"),ROWS($B$8:$B11))),\"0\"))","v":""},{"$f":"IF($B11=\"\",\"\",IFERROR(INDEX('quantities report'!$D$2:$D$10003,SMALL(IF('quantities report'!$A$2:$A$10003=AG$6,ROW('quantities report'!$A$2:$A$10003)-1,\"\"),ROWS($B$8:$B11))),\"0\"))","v":""},{"$f":"IF($B11=\"\",\"\",IFERROR(INDEX('quantities report'!$D$2:$D$10003,SMALL(IF('quantities report'!$A$2:$A$10003=AH$6,ROW('quantities report'!$A$2:$A$10003)-1,\"\"),ROWS($B$8:$B11))),\"0\"))","v":""},"","","","","",0.9,"",""]
[null,{"$f":"IFERROR(INDEX('manual inputs'!M:M,SMALL(IF('manual inputs'!M:M<>\"\",ROW('manual inputs'!M:M)),ROW(7:7))),\"\")","v":""},{"$f":"IF(B12=\"\",\"\",IFERROR(INDEX('quantities report'!$D$2:$D$10003,SMALL(IF('quantities report'!$A$2:$A$10003=C$6,ROW('quantities report'!$A$2:$A$10003)-1,\"\"),ROWS($B$8:$B12))),\"0\"))","v":""},"",null,"",{"$f":"IF($B12=\"\",\"\",Structure_Ex!I12)","v":""},null,{"$f":"IF($B12=\"\",\"\",IFERROR(INDEX('quantities report'!$D$2:$D$10003,SMALL(IF('quantities report'!$A$2:$A$10003=I$6,ROW('quantities report'!$A$2:$A$10003)-1,\"\"),ROWS($B$8:$B12))),\"0\"))","v":""},{"$f":"IF($B12=\"\",\"\",Removals!$F9)","v":""},{"$f":"IF($B12=\"\",\"\",Removals!$K9)","v":""},{"$f":"IF($B12=\"\",\"\",IFERROR(INDEX('quantities report'!$D$2:$D$10003,SMALL(IF('quantities report'!$A$2:$A$10003=L$6,ROW('quantities report'!$A$2:$A$10003)-1,\"\"),ROWS($B$8:$B12))),\"0\"))","v":""},{"$f":"IF(B12=\"\",\"\",LOOKUP(B12,'manual inputs'!$B$4:$B$22,'manual inputs'!$D$4:$D$22))","v":""},"",{"$f":"IF($B12=\"\",\"\",IFERROR(INDEX('quantities report'!$D$2:$D$10003,SMALL(IF('quantities report'!$A$2:$A$10003=O$6,ROW('quantities report'!$A$2:$A$10003)-1,\"\"),ROWS($B$8:$B12))),\"0\"))","v":""},"",null,"",{"$f":"IF($B12=\"\",\"\",IFERROR(INDEX('quantities report'!$D$2:$D$10003,SMALL(IF('quantities report'!$A$2:$A$10003=S$6,ROW('quantities report'!$A$2:$A$10003)-1,\"\"),ROWS($B$8:$B12))),\"0\"))","v":""},{"$f":"IF($B12=\"\",\"\",IFERROR(INDEX('quantities report'!$D$2:$D$10003,SMALL(IF('quantities report'!$A$2:$A$10003=T$6,ROW('quantities report'!$A$2:$A$10003)-1,\"\"),ROWS($B$8:$B12))),\"0\"))","v":""},{"$f":"IF($B12=\"\",\"\",IFERROR(INDEX('quantities report'!$D$2:$D$10003,SMALL(IF('quantities report'!$A$2:$A$10003=U$6,ROW('quantities report'!$A$2:$A$10003)-1,\"\"),ROWS($B$8:$B12))),\"0\"))","v":""},{"$f":"IF($B12=\"\",\"\",IFERROR(INDEX('quantities report'!$D$2:$D$10003,SMALL(IF('quantities report'!$A$2:$A$10003=V$6,ROW('quantities report'!$A$2:$A$10003)-1,\"\"),ROWS($B$8:$B12))),\"0\"))","v":""},{"$f":"IF($B12=\"\",\"\",IFERROR(INDEX('quantities report'!$D$2:$D$10003,SMALL(IF('quantities report'!$A$2:$A$10003=W$6,ROW('quantities report'!$A$2:$A$10003)-1,\"\"),ROWS($B$8:$B12))),\"0\"))","v":""},{"$f":"IF($B12=\"\",\"\",IFERROR(INDEX('quantities report'!$D$2:$D$10003,SMALL(IF('quantities report'!$A$2:$A$10003=X$6,ROW('quantities report'!$A$2:$A$10003)-1,\"\"),ROWS($B$8:$B12))),\"0\"))","v":""},{"$f":"IF($B12=\"\",\"\",IFERROR(INDEX('quantities report'!$D$2:$D$10003,SMALL(IF('quantities report'!$A$2:$A$10003=Y$6,ROW('quantities report'!$A$2:$A$10003)-1,\"\"),ROWS($B$8:$B12))),\"0\"))","v":""},{"$f":"IF($B12=\"\",\"\",IFERROR(INDEX('quantities report'!$D$2:$D$10003,SMALL(IF('quantities report'!$A$2:$A$10003=Z$6,ROW('quantities report'!$A$2:$A$10003)-1,\"\"),ROWS($B$8:$B12))),\"0\"))","v":""},{"$f":"IF($B12=\"\",\"\",Removals!$G9)","v":""},{"$f":"IF($B12=\"\",\"\",Removals!$L9)","v":""},{"$f":"IF($B12=\"\",\"\",IFERROR(INDEX('quantities report'!$D$2:$D$10003,SMALL(IF('quantities report'!$A$2:$A$10003=AC$6,ROW('quantities report'!$A$2:$A$10003)-1,\"\"),ROWS($B$8:$B12))),\"0\"))","v":""},{"$f":"IF($B12=\"\",\"\",IFERROR(INDEX('quantities report'!$D$2:$D$10003,SMALL(IF('quantities report'!$A$2:$A$10003=AD$6,ROW('quantities report'!$A$2:$A$10003)-1,\"\"),ROWS($B$8:$B12))),\"0\"))","v":""},{"$f":"IF($B12=\"\",\"\",IFERROR(INDEX('quantities report'!$D$2:$D$10003,SMALL(IF('quantities report'!$A$2:$A$10003=AE$6,ROW('quantities report'!$A$2:$A$10003)-1,\"\"),ROWS($B$8:$B12))),\"0\"))","v":""},{"$f":"IF($B12=\"\",\"\",IFERROR(INDEX('quantities report'!$D$2:$D$10003,SMALL(IF('quantities report'!$A$2:$A$10003=AF$6,ROW('quantities report'!$A$2:$A$10003)-1,\"\"),ROWS($B$8:$B12))),\"0\"))","v":""},{"$f":"IF($B12=\"\",\"\",IFERROR(INDEX('quantities report'!$D$2:$D$10003,SMALL(IF('quantities report'!$A$2:$A$10003=AG$6,ROW('quantities report'!$A$2:$A$10003)-1,\"\"),ROWS($B$8:$B12))),\"0\"))","v":""},{"$f":"IF($B12=\"\",\"\",IFERROR(INDEX('quantities report'!$D$2:$D$10003,SMALL(IF('quantities report'!$A$2:$A$10003=AH$6,ROW('quantities report'!$A$2:$A$10003)-1,\"\"),ROWS($B$8:$B12))),\"0\"))","v":""},"","","","","",0.9,"",""]
[null,{"$f":"IFERROR(INDEX('manual inputs'!M:M,SMALL(IF('manual inputs'!M:M<>\"\",ROW('manual inputs'!M:M)),ROW(8:8))),\"\")","v":""},{"$f":"IF(B13=\"\",\"\",IFERROR(INDEX('quantities report'!$D$2:$D$10003,SMALL(IF('quantities report'!$A$2:$A$10003=C$6,ROW('quantities report'!$A$2:$A$10003)-1,\"\"),ROWS($B$8:$B13))),\"0\"))","v":""},"",null,"",{"$f":"IF($B13=\"\",\"\",Structure_Ex!I13)","v":""},null,{"$f":"IF($B13=\"\",\"\",IFERROR(INDEX('quantities report'!$D$2:$D$10003,SMALL(IF('quantities report'!$A$2:$A$10003=I$6,ROW('quantities report'!$A$2:$A$10003)-1,\"\"),ROWS($B$8:$B13))),\"0\"))","v":""},{"$f":"IF($B13=\"\",\"\",Removals!$F10)","v":""},{"$f":"IF($B13=\"\",\"\",Removals!$K10)","v":""},{"$f":"IF($B13=\"\",\"\",IFERROR(INDEX('quantities report'!$D$2:$D$10003,SMALL(IF('quantities report'!$A$2:$A$10003=L$6,ROW('quantities report'!$A$2:$A$10003)-1,\"\"),ROWS($B$8:$B13))),\"0\"))","v":""},{"$f":"IF(B13=\"\",\"\",LOOKUP(B13,'manual inputs'!$B$4:$B$22,'manual inputs'!$D$4:$D$22))","v":""},"",{"$f":"IF($B13=\"\",\"\",IFERROR(INDEX('quantities report'!$D$2:$D$10003,SMALL(IF('quantities report'!$A$2:$A$10003=O$6,ROW('quantities report'!$A$2:$A$10003)-1,\"\"),ROWS($B$8:$B13))),\"0\"))","v":""},"",null,"",{"$f":"IF($B13=\"\",\"\",IFERROR(INDEX('quantities report'!$D$2:$D$10003,SMALL(IF('quantities report'!$A$2:$A$10003=S$6,ROW('quantities report'!$A$2:$A$10003)-1,\"\"),ROWS($B$8:$B13))),\"0\"))","v":""},{"$f":"IF($B13=\"\",\"\",IFERROR(INDEX('quantities report'!$D$2:$D$10003,SMALL(IF('quantities report'!$A$2:$A$10003=T$6,ROW('quantities report'!$A$2:$A$10003)-1,\"\"),ROWS($B$8:$B13))),\"0\"))","v":""},{"$f":"IF($B13=\"\",\"\",IFERROR(INDEX('quantities report'!$D$2:$D$10003,SMALL(IF('quantities report'!$A$2:$A$10003=U$6,ROW('quantities report'!$A$2:$A$10003)-1,\"\"),ROWS($B$8:$B13))),\"0\"))","v":""},{"$f":"IF($B13=\"\",\"\",IFERROR(INDEX('quantities report'!$D$2:$D$10003,SMALL(IF('quantities report'!$A$2:$A$10003=V$6,ROW('quantities report'!$A$2:$A$10003)-1,\"\"),ROWS($B$8:$B13))),\"0\"))","v":""},{"$f":"IF($B13=\"\",\"\",IFERROR(INDEX('quantities report'!$D$2:$D$10003,SMALL(IF('quantities report'!$A$2:$A$10003=W$6,ROW('quantities report'!$A$2:$A$10003)-1,\"\"),ROWS($B$8:$B13))),\"0\"))","v":""},{"$f":"IF($B13=\"\",\"\",IFERROR(INDEX('quantities report'!$D$2:$D$10003,SMALL(IF('quantities report'!$A$2:$A$10003=X$6,ROW('quantities report'!$A$2:$A$10003)-1,\"\"),ROWS($B$8:$B13))),\"0\"))","v":""},{"$f":"IF($B13=\"\",\"\",IFERROR(INDEX('quantities report'!$D$2:$D$10003,SMALL(IF('quantities report'!$A$2:$A$10003=Y$6,ROW('quantities report'!$A$2:$A$10003)-1,\"\"),ROWS($B$8:$B13))),\"0\"))","v":""},{"$f":"IF($B13=\"\",\"\",IFERROR(INDEX('quantities report'!$D$2:$D$10003,SMALL(IF('quantities report'!$A$2:$A$10003=Z$6,ROW('quantities report'!$A$2:$A$10003)-1,\"\"),ROWS($B$8:$B13))),\"0\"))","v":""},{"$f":"IF($B13=\"\",\"\",Removals!$G10)","v":""},{"$f":"IF($B13=\"\",\"\",Removals!$L10)","v":""},{"$f":"IF($B13=\"\",\"\",IFERROR(INDEX('quantities report'!$D$2:$D$10003,SMALL(IF('quantities report'!$A$2:$A$10003=AC$6,ROW('quantities report'!$A$2:$A$10003)-1,\"\"),ROWS($B$8:$B13))),\"0\"))","v":""},{"$f":"IF($B13=\"\",\"\",IFERROR(INDEX('quantities report'!$D$2:$D$10003,SMALL(IF('quantities report'!$A$2:$A$10003=AD$6,ROW('quantities report'!$A$2:$A$10003)-1,\"\"),ROWS($B$8:$B13))),\"0\"))","v":""},{"$f":"IF($B13=\"\",\"\",IFERROR(INDEX('quantities report'!$D$2:$D$10003,SMALL(IF('quantities report'!$A$2:$A$10003=AE$6,ROW('quantities report'!$A$2:$A$10003)-1,\"\"),ROWS($B$8:$B13))),\"0\"))","v":""},{"$f":"IF($B13=\"\",\"\",IFERROR(INDEX('quantities report'!$D$2:$D$10003,SMALL(IF('quantities report'!$A$2:$A$10003=AF$6,ROW('quantities report'!$A$2:$A$10003)-1,\"\"),ROWS($B$8:$B13))),\"0\"))","v":""},{"$f":"IF($B13=\"\",\"\",IFERROR(INDEX('quantities report'!$D$2:$D$10003,SMALL(IF('quantities report'!$A$2:$A$10003=AG$6,ROW('quantities report'!$A$2:$A$10003)-1,\"\"),ROWS($B$8:$B13))),\"0\"))","v":""},{"$f":"IF($B13=\"\",\"\",IFERROR(INDEX('quantities report'!$D$2:$D$10003,SMALL(IF('quantities report'!$A$2:$A$10003=AH$6,ROW('quantities report'!$A$2:$A$10003)-1,\"\"),ROWS($B$8:$B13))),\"0\"))","v":""},"","","","","",0.9,"",""]
[null,{"$f":"IFERROR(INDEX('manual inputs'!M:M,SMALL(IF('manual inputs'!M:M<>\"\",ROW('manual inputs'!M:M)),ROW(9:9))),\"\")","v":""},{"$f":"IF(B14=\"\",\"\",IFERROR(INDEX('quantities report'!$D$2:$D$10003,SMALL(IF('quantities report'!$A$2:$A$10003=C$6,ROW('quantities report'!$A$2:$A$10003)-1,\"\"),ROWS($B$8:$B14))),\"0\"))","v":""},"",null,"",{"$f":"IF($B14=\"\",\"\",Structure_Ex!I14)","v":""},null,{"$f":"IF($B14=\"\",\"\",IFERROR(INDEX('quantities report'!$D$2:$D$10003,SMALL(IF('quantities report'!$A$2:$A$10003=I$6,ROW('quantities report'!$A$2:$A$10003)-1,\"\"),ROWS($B$8:$B14))),\"0\"))","v":""},{"$f":"IF($B14=\"\",\"\",Removals!$F11)","v":""},{"$f":"IF($B14=\"\",\"\",Removals!$K11)","v":""},{"$f":"IF($B14=\"\",\"\",IFERROR(INDEX('quantities report'!$D$2:$D$10003,SMALL(IF('quantities report'!$A$2:$A$10003=L$6,ROW('quantities report'!$A$2:$A$10003)-1,\"\"),ROWS($B$8:$B14))),\"0\"))","v":""},{"$f":"IF(B14=\"\",\"\",LOOKUP(B14,'manual inputs'!$B$4:$B$22,'manual inputs'!$D$4:$D$22))","v":""},"",{"$f":"IF($B14=\"\",\"\",IFERROR(INDEX('quantities report'!$D$2:$D$10003,SMALL(IF('quantities report'!$A$2:$A$10003=O$6,ROW('quantities report'!$A$2:$A$10003)-1,\"\"),ROWS($B$8:$B14))),\"0\"))","v":""},"",null,"",{"$f":"IF($B14=\"\",\"\",IFERROR(INDEX('quantities report'!$D$2:$D$10003,SMALL(IF('quantities report'!$A$2:$A$10003=S$6,ROW('quantities report'!$A$2:$A$10003)-1,\"\"),ROWS($B$8:$B14))),\"0\"))","v":""},{"$f":"IF($B14=\"\",\"\",IFERROR(INDEX('quantities report'!$D$2:$D$10003,SMALL(IF('quantities report'!$A$2:$A$10003=T$6,ROW('quantities report'!$A$2:$A$10003)-1,\"\"),ROWS($B$8:$B14))),\"0\"))","v":""},{"$f":"IF($B14=\"\",\"\",IFERROR(INDEX('quantities report'!$D$2:$D$10003,SMALL(IF('quantities report'!$A$2:$A$10003=U$6,ROW('quantities report'!$A$2:$A$10003)-1,\"\"),ROWS($B$8:$B14))),\"0\"))","v":""},{"$f":"IF($B14=\"\",\"\",IFERROR(INDEX('quantities report'!$D$2:$D$10003,SMALL(IF('quantities report'!$A$2:$A$10003=V$6,ROW('quantities report'!$A$2:$A$10003)-1,\"\"),ROWS($B$8:$B14))),\"0\"))","v":""},{"$f":"IF($B14=\"\",\"\",IFERROR(INDEX('quantities report'!$D$2:$D$10003,SMALL(IF('quantities report'!$A$2:$A$10003=W$6,ROW('quantities report'!$A$2:$A$10003)-1,\"\"),ROWS($B$8:$B14))),\"0\"))","v":""},{"$f":"IF($B14=\"\",\"\",IFERROR(INDEX('quantities report'!$D$2:$D$10003,SMALL(IF('quantities report'!$A$2:$A$10003=X$6,ROW('quantities report'!$A$2:$A$10003)-1,\"\"),ROWS($B$8:$B14))),\"0\"))","v":""},{"$f":"IF($B14=\"\",\"\",IFERROR(INDEX('quantities report'!$D$2:$D$10003,SMALL(IF('quantities report'!$A$2:$A$10003=Y$6,ROW('quantities report'!$A$2:$A$10003)-1,\"\"),ROWS($B$8:$B14))),\"0\"))","v":""},{"$f":"IF($B14=\"\",\"\",IFERROR(INDEX('quantities report'!$D$2:$D$10003,SMALL(IF('quantities report'!$A$2:$A$10003=Z$6,ROW('quantities report'!$A$2:$A$10003)-1,\"\"),ROWS($B$8:$B14))),\"0\"))","v":""},{"$f":"IF($B14=\"\",\"\",Removals!$G11)","v":""},{"$f":"IF($B14=\"\",\"\",Removals!$L11)","v":""},{"$f":"IF($B14=\"\",\"\",IFERROR(INDEX('quantities report'!$D$2:$D$10003,SMALL(IF('quantities report'!$A$2:$A$10003=AC$6,ROW('quantities report'!$A$2:$A$10003)-1,\"\"),ROWS($B$8:$B14))),\"0\"))","v":""},{"$f":"IF($B14=\"\",\"\",IFERROR(INDEX('quantities report'!$D$2:$D$10003,SMALL(IF('quantities report'!$A$2:$A$10003=AD$6,ROW('quantities report'!$A$2:$A$10003)-1,\"\"),ROWS($B$8:$B14))),\"0\"))","v":""},{"$f":"IF($B14=\"\",\"\",IFERROR(INDEX('quantities report'!$D$2:$D$10003,SMALL(IF('quantities report'!$A$2:$A$10003=AE$6,ROW('quantities report'!$A$2:$A$10003)-1,\"\"),ROWS($B$8:$B14))),\"0\"))","v":""},{"$f":"IF($B14=\"\",\"\",IFERROR(INDEX('quantities report'!$D$2:$D$10003,SMALL(IF('quantities report'!$A$2:$A$10003=AF$6,ROW('quantities report'!$A$2:$A$10003)-1,\"\"),ROWS($B$8:$B14))),\"0\"))","v":""},{"$f":"IF($B14=\"\",\"\",IFERROR(INDEX('quantities report'!$D$2:$D$10003,SMALL(IF('quantities report'!$A$2:$A$10003=AG$6,ROW('quantities report'!$A$2:$A$10003)-1,\"\"),ROWS($B$8:$B14))),\"0\"))","v":""},{"$f":"IF($B14=\"\",\"\",IFERROR(INDEX('quantities report'!$D$2:$D$10003,SMALL(IF('quantities report'!$A$2:$A$10003=AH$6,ROW('quantities report'!$A$2:$A$10003)-1,\"\"),ROWS($B$8:$B14))),\"0\"))","v":""},"","","","","",0.9,"",""]
[null,{"$f":"IFERROR(INDEX('manual inputs'!M:M,SMALL(IF('manual inputs'!M:M<>\"\",ROW('manual inputs'!M:M)),ROW(10:10))),\"\")","v":""},{"$f":"IF(B15=\"\",\"\",IFERROR(INDEX('quantities report'!$D$2:$D$10003,SMALL(IF('quantities report'!$A$2:$A$10003=C$6,ROW('quantities report'!$A$2:$A$10003)-1,\"\"),ROWS($B$8:$B15))),\"0\"))","v":""},"",null,"",{"$f":"IF($B15=\"\",\"\",Structure_Ex!I15)","v":""},null,{"$f":"IF($B15=\"\",\"\",IFERROR(INDEX('quantities report'!$D$2:$D$10003,SMALL(IF('quantities report'!$A$2:$A$10003=I$6,ROW('quantities report'!$A$2:$A$10003)-1,\"\"),ROWS($B$8:$B15))),\"0\"))","v":""},{"$f":"IF($B15=\"\",\"\",Removals!$F12)","v":""},{"$f":"IF($B15=\"\",\"\",Removals!$K12)","v":""},{"$f":"IF($B15=\"\",\"\",IFERROR(INDEX('quantities report'!$D$2:$D$10003,SMALL(IF('quantities report'!$A$2:$A$10003=L$6,ROW('quantities report'!$A$2:$A$10003)-1,\"\"),ROWS($B$8:$B15))),\"0\"))","v":""},{"$f":"IF(B15=\"\",\"\",LOOKUP(B15,'manual inputs'!$B$4:$B$22,'manual inputs'!$D$4:$D$22))","v":""},"",{"$f":"IF($B15=\"\",\"\",IFERROR(INDEX('quantities report'!$D$2:$D$10003,SMALL(IF('quantities report'!$A$2:$A$10003=O$6,ROW('quantities report'!$A$2:$A$10003)-1,\"\"),ROWS($B$8:$B15))),\"0\"))","v":""},"",null,"",{"$f":"IF($B15=\"\",\"\",IFERROR(INDEX('quantities report'!$D$2:$D$10003,SMALL(IF('quantities report'!$A$2:$A$10003=S$6,ROW('quantities report'!$A$2:$A$10003)-1,\"\"),ROWS($B$8:$B15))),\"0\"))","v":""},{"$f":"IF($B15=\"\",\"\",IFERROR(INDEX('quantities report'!$D$2:$D$10003,SMALL(IF('quantities report'!$A$2:$A$10003=T$6,ROW('quantities report'!$A$2:$A$10003)-1,\"\"),ROWS($B$8:$B15))),\"0\"))","v":""},{"$f":"IF($B15=\"\",\"\",IFERROR(INDEX('quantities report'!$D$2:$D$10003,SMALL(IF('quantities report'!$A$2:$A$10003=U$6,ROW('quantities report'!$A$2:$A$10003)-1,\"\"),ROWS($B$8:$B15))),\"0\"))","v":""},{"$f":"IF($B15=\"\",\"\",IFERROR(INDEX('quantities report'!$D$2:$D$10003,SMALL(IF('quantities report'!$A$2:$A$10003=V$6,ROW('quantities report'!$A$2:$A$10003)-1,\"\"),ROWS($B$8:$B15))),\"0\"))","v":""},{"$f":"IF($B15=\"\",\"\",IFERROR(INDEX('quantities report'!$D$2:$D$10003,SMALL(IF('quantities report'!$A$2:$A$10003=W$6,ROW('quantities report'!$A$2:$A$10003)-1,\"\"),ROWS($B$8:$B15))),\"0\"))","v":""},{"$f":"IF($B15=\"\",\"\",IFERROR(INDEX('quantities report'!$D$2:$D$10003,SMALL(IF('quantities report'!$A$2:$A$10003=X$6,ROW('quantities report'!$A$2:$A$10003)-1,\"\"),ROWS($B$8:$B15))),\"0\"))","v":""},{"$f":"IF($B15=\"\",\"\",IFERROR(INDEX('quantities report'!$D$2:$D$10003,SMALL(IF('quantities report'!$A$2:$A$10003=Y$6,ROW('quantities report'!$A$2:$A$10003)-1,\"\"),ROWS($B$8:$B15))),\"0\"))","v":""},{"$f":"IF($B15=\"\",\"\",IFERROR(INDEX('quantities report'!$D$2:$D$10003,SMALL(IF('quantities report'!$A$2:$A$10003=Z$6,ROW('quantities report'!$A$2:$A$10003)-1,\"\"),ROWS($B$8:$B15))),\"0\"))","v":""},{"$f":"IF($B15=\"\",\"\",Removals!$G12)","v":""},{"$f":"IF($B15=\"\",\"\",Removals!$L12)","v":""},{"$f":"IF($B15=\"\",\"\",IFERROR(INDEX('quantities report'!$D$2:$D$10003,SMALL(IF('quantities report'!$A$2:$A$10003=AC$6,ROW('quantities report'!$A$2:$A$10003)-1,\"\"),ROWS($B$8:$B15))),\"0\"))","v":""},{"$f":"IF($B15=\"\",\"\",IFERROR(INDEX('quantities report'!$D$2:$D$10003,SMALL(IF('quantities report'!$A$2:$A$10003=AD$6,ROW('quantities report'!$A$2:$A$10003)-1,\"\"),ROWS($B$8:$B15))),\"0\"))","v":""},{"$f":"IF($B15=\"\",\"\",IFERROR(INDEX('quantities report'!$D$2:$D$10003,SMALL(IF('quantities report'!$A$2:$A$10003=AE$6,ROW('quantities report'!$A$2:$A$10003)-1,\"\"),ROWS($B$8:$B15))),\"0\"))","v":""},{"$f":"IF($B15=\"\",\"\",IFERROR(INDEX('quantities report'!$D$2:$D$10003,SMALL(IF('quantities report'!$A$2:$A$10003=AF$6,ROW('quantities report'!$A$2:$A$10003)-1,\"\"),ROWS($B$8:$B15))),\"0\"))","v":""},{"$f":"IF($B15=\"\",\"\",IFERROR(INDEX('quantities report'!$D$2:$D$10003,SMALL(IF('quantities report'!$A$2:$A$10003=AG$6,ROW('quantities report'!$A$2:$A$10003)-1,\"\"),ROWS($B$8:$B15))),\"0\"))","v":""},{"$f":"IF($B15=\"\",\"\",IFERROR(INDEX('quantities report'!$D$2:$D$10003,SMALL(IF('quantities report'!$A$2:$A$10003=AH$6,ROW('quantities report'!$A$2:$A$10003)-1,\"\"),ROWS($B$8:$B15))),\"0\"))","v":""},"","","","","",0.9,"",""]
[null,{"$f":"IFERROR(INDEX('manual inputs'!M:M,SMALL(IF('manual inputs'!M:M<>\"\",ROW('manual inputs'!M:M)),ROW(11:11))),\"\")","v":""},{"$f":"IF(B16=\"\",\"\",IFERROR(INDEX('quantities report'!$D$2:$D$10003,SMALL(IF('quantities report'!$A$2:$A$10003=C$6,ROW('quantities report'!$A$2:$A$10003)-1,\"\"),ROWS($B$8:$B16))),\"0\"))","v":""},"",null,"",{"$f":"IF($B16=\"\",\"\",Structure_Ex!I16)","v":""},null,{"$f":"IF($B16=\"\",\"\",IFERROR(INDEX('quantities report'!$D$2:$D$10003,SMALL(IF('quantities report'!$A$2:$A$10003=I$6,ROW('quantities report'!$A$2:$A$10003)-1,\"\"),ROWS($B$8:$B16))),\"0\"))","v":""},{"$f":"IF($B16=\"\",\"\",Removals!$F13)","v":""},{"$f":"IF($B16=\"\",\"\",Removals!$K13)","v":""},{"$f":"IF($B16=\"\",\"\",IFERROR(INDEX('quantities report'!$D$2:$D$10003,SMALL(IF('quantities report'!$A$2:$A$10003=L$6,ROW('quantities report'!$A$2:$A$10003)-1,\"\"),ROWS($B$8:$B16))),\"0\"))","v":""},{"$f":"IF(B16=\"\",\"\",LOOKUP(B16,'manual inputs'!$B$4:$B$22,'manual inputs'!$D$4:$D$22))","v":""},"",{"$f":"IF($B16=\"\",\"\",IFERROR(INDEX('quantities report'!$D$2:$D$10003,SMALL(IF('quantities report'!$A$2:$A$10003=O$6,ROW('quantities report'!$A$2:$A$10003)-1,\"\"),ROWS($B$8:$B16))),\"0\"))","v":""},"",null,"",{"$f":"IF($B16=\"\",\"\",IFERROR(INDEX('quantities report'!$D$2:$D$10003,SMALL(IF('quantities report'!$A$2:$A$10003=S$6,ROW('quantities report'!$A$2:$A$10003)-1,\"\"),ROWS($B$8:$B16))),\"0\"))","v":""},{"$f":"IF($B16=\"\",\"\",IFERROR(INDEX('quantities report'!$D$2:$D$10003,SMALL(IF('quantities report'!$A$2:$A$10003=T$6,ROW('quantities report'!$A$2:$A$10003)-1,\"\"),ROWS($B$8:$B16))),\"0\"))","v":""},{"$f":"IF($B16=\"\",\"\",IFERROR(INDEX('quantities report'!$D$2:$D$10003,SMALL(IF('quantities report'!$A$2:$A$10003=U$6,ROW('quantities report'!$A$2:$A$10003)-1,\"\"),ROWS($B$8:$B16))),\"0\"))","v":""},{"$f":"IF($B16=\"\",\"\",IFERROR(INDEX('quantities report'!$D$2:$D$10003,SMALL(IF('quantities report'!$A$2:$A$10003=V$6,ROW('quantities report'!$A$2:$A$10003)-1,\"\"),ROWS($B$8:$B16))),\"0\"))","v":""},{"$f":"IF($B16=\"\",\"\",IFERROR(INDEX('quantities report'!$D$2:$D$10003,SMALL(IF('quantities report'!$A$2:$A$10003=W$6,ROW('quantities report'!$A$2:$A$10003)-1,\"\"),ROWS($B$8:$B16))),\"0\"))","v":""},{"$f":"IF($B16=\"\",\"\",IFERROR(INDEX('quantities report'!$D$2:$D$10003,SMALL(IF('quantities report'!$A$2:$A$10003=X$6,ROW('quantities report'!$A$2:$A$10003)-1,\"\"),ROWS($B$8:$B16))),\"0\"))","v":""},{"$f":"IF($B16=\"\",\"\",IFERROR(INDEX('quantities report'!$D$2:$D$10003,SMALL(IF('quantities report'!$A$2:$A$10003=Y$6,ROW('quantities report'!$A$2:$A$10003)-1,\"\"),ROWS($B$8:$B16))),\"0\"))","v":""},{"$f":"IF($B16=\"\",\"\",IFERROR(INDEX('quantities report'!$D$2:$D$10003,SMALL(IF('quantities report'!$A$2:$A$10003=Z$6,ROW('quantities report'!$A$2:$A$10003)-1,\"\"),ROWS($B$8:$B16))),\"0\"))","v":""},{"$f":"IF($B16=\"\",\"\",Removals!$G13)","v":""},{"$f":"IF($B16=\"\",\"\",Removals!$L13)","v":""},{"$f":"IF($B16=\"\",\"\",IFERROR(INDEX('quantities report'!$D$2:$D$10003,SMALL(IF('quantities report'!$A$2:$A$10003=AC$6,ROW('quantities report'!$A$2:$A$10003)-1,\"\"),ROWS($B$8:$B16))),\"0\"))","v":""},{"$f":"IF($B16=\"\",\"\",IFERROR(INDEX('quantities report'!$D$2:$D$10003,SMALL(IF('quantities report'!$A$2:$A$10003=AD$6,ROW('quantities report'!$A$2:$A$10003)-1,\"\"),ROWS($B$8:$B16))),\"0\"))","v":""},{"$f":"IF($B16=\"\",\"\",IFERROR(INDEX('quantities report'!$D$2:$D$10003,SMALL(IF('quantities report'!$A$2:$A$10003=AE$6,ROW('quantities report'!$A$2:$A$10003)-1,\"\"),ROWS($B$8:$B16))),\"0\"))","v":""},{"$f":"IF($B16=\"\",\"\",IFERROR(INDEX('quantities report'!$D$2:$D$10003,SMALL(IF('quantities report'!$A$2:$A$10003=AF$6,ROW('quantities report'!$A$2:$A$10003)-1,\"\"),ROWS($B$8:$B16))),\"0\"))","v":""},{"$f":"IF($B16=\"\",\"\",IFERROR(INDEX('quantities report'!$D$2:$D$10003,SMALL(IF('quantities report'!$A$2:$A$10003=AG$6,ROW('quantities report'!$A$2:$A$10003)-1,\"\"),ROWS($B$8:$B16))),\"0\"))","v":""},{"$f":"IF($B16=\"\",\"\",IFERROR(INDEX('quantities report'!$D$2:$D$10003,SMALL(IF('quantities report'!$A$2:$A$10003=AH$6,ROW('quantities report'!$A$2:$A$10003)-1,\"\"),ROWS($B$8:$B16))),\"0\"))","v":""},"","","","","",0.9,"",""]
[null,{"$f":"IFERROR(INDEX('manual inputs'!M:M,SMALL(IF('manual inputs'!M:M<>\"\",ROW('manual inputs'!M:M)),ROW(12:12))),\"\")","v":""},{"$f":"IF(B17=\"\",\"\",IFERROR(INDEX('quantities report'!$D$2:$D$10003,SMALL(IF('quantities report'!$A$2:$A$10003=C$6,ROW('quantities report'!$A$2:$A$10003)-1,\"\"),ROWS($B$8:$B17))),\"0\"))","v":""},"",null,"",{"$f":"IF($B17=\"\",\"\",Structure_Ex!I17)","v":""},null,{"$f":"IF($B17=\"\",\"\",IFERROR(INDEX('quantities report'!$D$2:$D$10003,SMALL(IF('quantities report'!$A$2:$A$10003=I$6,ROW('quantities report'!$A$2:$A$10003)-1,\"\"),ROWS($B$8:$B17))),\"0\"))","v":""},{"$f":"IF($B17=\"\",\"\",Removals!$F14)","v":""},{"$f":"IF($B17=\"\",\"\",Removals!$K14)","v":""},{"$f":"IF($B17=\"\",\"\",IFERROR(INDEX('quantities report'!$D$2:$D$10003,SMALL(IF('quantities report'!$A$2:$A$10003=L$6,ROW('quantities report'!$A$2:$A$10003)-1,\"\"),ROWS($B$8:$B17))),\"0\"))","v":""},{"$f":"IF(B17=\"\",\"\",LOOKUP(B17,'manual inputs'!$B$4:$B$22,'manual inputs'!$D$4:$D$22))","v":""},"",{"$f":"IF($B17=\"\",\"\",IFERROR(INDEX('quantities report'!$D$2:$D$10003,SMALL(IF('quantities report'!$A$2:$A$10003=O$6,ROW('quantities report'!$A$2:$A$10003)-1,\"\"),ROWS($B$8:$B17))),\"0\"))","v":""},"",null,"",{"$f":"IF($B17=\"\",\"\",IFERROR(INDEX('quantities report'!$D$2:$D$10003,SMALL(IF('quantities report'!$A$2:$A$10003=S$6,ROW('quantities report'!$A$2:$A$10003)-1,\"\"),ROWS($B$8:$B17))),\"0\"))","v":""},{"$f":"IF($B17=\"\",\"\",IFERROR(INDEX('quantities report'!$D$2:$D$10003,SMALL(IF('quantities report'!$A$2:$A$10003=T$6,ROW('quantities report'!$A$2:$A$10003)-1,\"\"),ROWS($B$8:$B17))),\"0\"))","v":""},{"$f":"IF($B17=\"\",\"\",IFERROR(INDEX('quantities report'!$D$2:$D$10003,SMALL(IF('quantities report'!$A$2:$A$10003=U$6,ROW('quantities report'!$A$2:$A$10003)-1,\"\"),ROWS($B$8:$B17))),\"0\"))","v":""},{"$f":"IF($B17=\"\",\"\",IFERROR(INDEX('quantities report'!$D$2:$D$10003,SMALL(IF('quantities report'!$A$2:$A$10003=V$6,ROW('quantities report'!$A$2:$A$10003)-1,\"\"),ROWS($B$8:$B17))),\"0\"))","v":""},{"$f":"IF($B17=\"\",\"\",IFERROR(INDEX('quantities report'!$D$2:$D$10003,SMALL(IF('quantities report'!$A$2:$A$10003=W$6,ROW('quantities report'!$A$2:$A$10003)-1,\"\"),ROWS($B$8:$B17))),\"0\"))","v":""},{"$f":"IF($B17=\"\",\"\",IFERROR(INDEX('quantities report'!$D$2:$D$10003,SMALL(IF('quantities report'!$A$2:$A$10003=X$6,ROW('quantities report'!$A$2:$A$10003)-1,\"\"),ROWS($B$8:$B17))),\"0\"))","v":""},{"$f":"IF($B17=\"\",\"\",IFERROR(INDEX('quantities report'!$D$2:$D$10003,SMALL(IF('quantities report'!$A$2:$A$10003=Y$6,ROW('quantities report'!$A$2:$A$10003)-1,\"\"),ROWS($B$8:$B17))),\"0\"))","v":""},{"$f":"IF($B17=\"\",\"\",IFERROR(INDEX('quantities report'!$D$2:$D$10003,SMALL(IF('quantities report'!$A$2:$A$10003=Z$6,ROW('quantities report'!$A$2:$A$10003)-1,\"\"),ROWS($B$8:$B17))),\"0\"))","v":""},{"$f":"IF($B17=\"\",\"\",Removals!$G14)","v":""},{"$f":"IF($B17=\"\",\"\",Removals!$L14)","v":""},{"$f":"IF($B17=\"\",\"\",IFERROR(INDEX('quantities report'!$D$2:$D$10003,SMALL(IF('quantities report'!$A$2:$A$10003=AC$6,ROW('quantities report'!$A$2:$A$10003)-1,\"\"),ROWS($B$8:$B17))),\"0\"))","v":""},{"$f":"IF($B17=\"\",\"\",IFERROR(INDEX('quantities report'!$D$2:$D$10003,SMALL(IF('quantities report'!$A$2:$A$10003=AD$6,ROW('quantities report'!$A$2:$A$10003)-1,\"\"),ROWS($B$8:$B17))),\"0\"))","v":""},{"$f":"IF($B17=\"\",\"\",IFERROR(INDEX('quantities report'!$D$2:$D$10003,SMALL(IF('quantities report'!$A$2:$A$10003=AE$6,ROW('quantities report'!$A$2:$A$10003)-1,\"\"),ROWS($B$8:$B17))),\"0\"))","v":""},{"$f":"IF($B17=\"\",\"\",IFERROR(INDEX('quantities report'!$D$2:$D$10003,SMALL(IF('quantities report'!$A$2:$A$10003=AF$6,ROW('quantities report'!$A$2:$A$10003)-1,\"\"),ROWS($B$8:$B17))),\"0\"))","v":""},{"$f":"IF($B17=\"\",\"\",IFERROR(INDEX('quantities report'!$D$2:$D$10003,SMALL(IF('quantities report'!$A$2:$A$10003=AG$6,ROW('quantities report'!$A$2:$A$10003)-1,\"\"),ROWS($B$8:$B17))),\"0\"))","v":""},{"$f":"IF($B17=\"\",\"\",IFERROR(INDEX('quantities report'!$D$2:$D$10003,SMALL(IF('quantities report'!$A$2:$A$10003=AH$6,ROW('quantities report'!$A$2:$A$10003)-1,\"\"),ROWS($B$8:$B17))),\"0\"))","v":""},"","","","","",0.9,"",""]
[null,{"$f":"IFERROR(INDEX('manual inputs'!M:M,SMALL(IF('manual inputs'!M:M<>\"\",ROW('manual inputs'!M:M)),ROW(13:13))),\"\")","v":""},{"$f":"IF(B18=\"\",\"\",IFERROR(INDEX('quantities report'!$D$2:$D$10003,SMALL(IF('quantities report'!$A$2:$A$10003=C$6,ROW('quantities report'!$A$2:$A$10003)-1,\"\"),ROWS($B$8:$B18))),\"0\"))","v":""},"",null,"",{"$f":"IF($B18=\"\",\"\",Structure_Ex!I18)","v":""},null,{"$f":"IF($B18=\"\",\"\",IFERROR(INDEX('quantities report'!$D$2:$D$10003,SMALL(IF('quantities report'!$A$2:$A$10003=I$6,ROW('quantities report'!$A$2:$A$10003)-1,\"\"),ROWS($B$8:$B18))),\"0\"))","v":""},{"$f":"IF($B18=\"\",\"\",Removals!$F15)","v":""},{"$f":"IF($B18=\"\",\"\",Removals!$K15)","v":""},{"$f":"IF($B18=\"\",\"\",IFERROR(INDEX('quantities report'!$D$2:$D$10003,SMALL(IF('quantities report'!$A$2:$A$10003=L$6,ROW('quantities report'!$A$2:$A$10003)-1,\"\"),ROWS($B$8:$B18))),\"0\"))","v":""},{"$f":"IF(B18=\"\",\"\",LOOKUP(B18,'manual inputs'!$B$4:$B$22,'manual inputs'!$D$4:$D$22))","v":""},"",{"$f":"IF($B18=\"\",\"\",IFERROR(INDEX('quantities report'!$D$2:$D$10003,SMALL(IF('quantities report'!$A$2:$A$10003=O$6,ROW('quantities report'!$A$2:$A$10003)-1,\"\"),ROWS($B$8:$B18))),\"0\"))","v":""},"",null,"",{"$f":"IF($B18=\"\",\"\",IFERROR(INDEX('quantities report'!$D$2:$D$10003,SMALL(IF('quantities report'!$A$2:$A$10003=S$6,ROW('quantities report'!$A$2:$A$10003)-1,\"\"),ROWS($B$8:$B18))),\"0\"))","v":""},{"$f":"IF($B18=\"\",\"\",IFERROR(INDEX('quantities report'!$D$2:$D$10003,SMALL(IF('quantities report'!$A$2:$A$10003=T$6,ROW('quantities report'!$A$2:$A$10003)-1,\"\"),ROWS($B$8:$B18))),\"0\"))","v":""},{"$f":"IF($B18=\"\",\"\",IFERROR(INDEX('quantities report'!$D$2:$D$10003,SMALL(IF('quantities report'!$A$2:$A$10003=U$6,ROW('quantities report'!$A$2:$A$10003)-1,\"\"),ROWS($B$8:$B18))),\"0\"))","v":""},{"$f":"IF($B18=\"\",\"\",IFERROR(INDEX('quantities report'!$D$2:$D$10003,SMALL(IF('quantities report'!$A$2:$A$10003=V$6,ROW('quantities report'!$A$2:$A$10003)-1,\"\"),ROWS($B$8:$B18))),\"0\"))","v":""},{"$f":"IF($B18=\"\",\"\",IFERROR(INDEX('quantities report'!$D$2:$D$10003,SMALL(IF('quantities report'!$A$2:$A$10003=W$6,ROW('quantities report'!$A$2:$A$10003)-1,\"\"),ROWS($B$8:$B18))),\"0\"))","v":""},{"$f":"IF($B18=\"\",\"\",IFERROR(INDEX('quantities report'!$D$2:$D$10003,SMALL(IF('quantities report'!$A$2:$A$10003=X$6,ROW('quantities report'!$A$2:$A$10003)-1,\"\"),ROWS($B$8:$B18))),\"0\"))","v":""},{"$f":"IF($B18=\"\",\"\",IFERROR(INDEX('quantities report'!$D$2:$D$10003,SMALL(IF('quantities report'!$A$2:$A$10003=Y$6,ROW('quantities report'!$A$2:$A$10003)-1,\"\"),ROWS($B$8:$B18))),\"0\"))","v":""},{"$f":"IF($B18=\"\",\"\",IFERROR(INDEX('quantities report'!$D$2:$D$10003,SMALL(IF('quantities report'!$A$2:$A$10003=Z$6,ROW('quantities report'!$A$2:$A$10003)-1,\"\"),ROWS($B$8:$B18))),\"0\"))","v":""},{"$f":"IF($B18=\"\",\"\",Removals!$G15)","v":""},{"$f":"IF($B18=\"\",\"\",Removals!$L15)","v":""},{"$f":"IF($B18=\"\",\"\",IFERROR(INDEX('quantities report'!$D$2:$D$10003,SMALL(IF('quantities report'!$A$2:$A$10003=AC$6,ROW('quantities report'!$A$2:$A$10003)-1,\"\"),ROWS($B$8:$B18))),\"0\"))","v":""},{"$f":"IF($B18=\"\",\"\",IFERROR(INDEX('quantities report'!$D$2:$D$10003,SMALL(IF('quantities report'!$A$2:$A$10003=AD$6,ROW('quantities report'!$A$2:$A$10003)-1,\"\"),ROWS($B$8:$B18))),\"0\"))","v":""},{"$f":"IF($B18=\"\",\"\",IFERROR(INDEX('quantities report'!$D$2:$D$10003,SMALL(IF('quantities report'!$A$2:$A$10003=AE$6,ROW('quantities report'!$A$2:$A$10003)-1,\"\"),ROWS($B$8:$B18))),\"0\"))","v":""},{"$f":"IF($B18=\"\",\"\",IFERROR(INDEX('quantities report'!$D$2:$D$10003,SMALL(IF('quantities report'!$A$2:$A$10003=AF$6,ROW('quantities report'!$A$2:$A$10003)-1,\"\"),ROWS($B$8:$B18))),\"0\"))","v":""},{"$f":"IF($B18=\"\",\"\",IFERROR(INDEX('quantities report'!$D$2:$D$10003,SMALL(IF('quantities report'!$A$2:$A$10003=AG$6,ROW('quantities report'!$A$2:$A$10003)-1,\"\"),ROWS($B$8:$B18))),\"0\"))","v":""},{"$f":"IF($B18=\"\",\"\",IFERROR(INDEX('quantities report'!$D$2:$D$10003,SMALL(IF('quantities report'!$A$2:$A$10003=AH$6,ROW('quantities report'!$A$2:$A$10003)-1,\"\"),ROWS($B$8:$B18))),\"0\"))","v":""},"","","","","",0.9,"",""]
[null,{"$f":"IFERROR(INDEX('manual inputs'!M:M,SMALL(IF('manual inputs'!M:M<>\"\",ROW('manual inputs'!M:M)),ROW(14:14))),\"\")","v":""},{"$f":"IF(B19=\"\",\"\",IFERROR(INDEX('quantities report'!$D$2:$D$10003,SMALL(IF('quantities report'!$A$2:$A$10003=C$6,ROW('quantities report'!$A$2:$A$10003)-1,\"\"),ROWS($B$8:$B19))),\"0\"))","v":""},"",null,"",{"$f":"IF($B19=\"\",\"\",Structure_Ex!I19)","v":""},null,{"$f":"IF($B19=\"\",\"\",IFERROR(INDEX('quantities report'!$D$2:$D$10003,SMALL(IF('quantities report'!$A$2:$A$10003=I$6,ROW('quantities report'!$A$2:$A$10003)-1,\"\"),ROWS($B$8:$B19))),\"0\"))","v":""},{"$f":"IF($B19=\"\",\"\",Removals!$F16)","v":""},{"$f":"IF($B19=\"\",\"\",Removals!$K16)","v":""},{"$f":"IF($B19=\"\",\"\",IFERROR(INDEX('quantities report'!$D$2:$D$10003,SMALL(IF('quantities report'!$A$2:$A$10003=L$6,ROW('quantities report'!$A$2:$A$10003)-1,\"\"),ROWS($B$8:$B19))),\"0\"))","v":""},{"$f":"IF(B19=\"\",\"\",LOOKUP(B19,'manual inputs'!$B$4:$B$22,'manual inputs'!$D$4:$D$22))","v":""},"",{"$f":"IF($B19=\"\",\"\",IFERROR(INDEX('quantities report'!$D$2:$D$10003,SMALL(IF('quantities report'!$A$2:$A$10003=O$6,ROW('quantities report'!$A$2:$A$10003)-1,\"\"),ROWS($B$8:$B19))),\"0\"))","v":""},"",null,"",{"$f":"IF($B19=\"\",\"\",IFERROR(INDEX('quantities report'!$D$2:$D$10003,SMALL(IF('quantities report'!$A$2:$A$10003=S$6,ROW('quantities report'!$A$2:$A$10003)-1,\"\"),ROWS($B$8:$B19))),\"0\"))","v":""},{"$f":"IF($B19=\"\",\"\",IFERROR(INDEX('quantities report'!$D$2:$D$10003,SMALL(IF('quantities report'!$A$2:$A$10003=T$6,ROW('quantities report'!$A$2:$A$10003)-1,\"\"),ROWS($B$8:$B19))),\"0\"))","v":""},{"$f":"IF($B19=\"\",\"\",IFERROR(INDEX('quantities report'!$D$2:$D$10003,SMALL(IF('quantities report'!$A$2:$A$10003=U$6,ROW('quantities report'!$A$2:$A$10003)-1,\"\"),ROWS($B$8:$B19))),\"0\"))","v":""},{"$f":"IF($B19=\"\",\"\",IFERROR(INDEX('quantities report'!$D$2:$D$10003,SMALL(IF('quantities report'!$A$2:$A$10003=V$6,ROW('quantities report'!$A$2:$A$10003)-1,\"\"),ROWS($B$8:$B19))),\"0\"))","v":""},{"$f":"IF($B19=\"\",\"\",IFERROR(INDEX('quantities report'!$D$2:$D$10003,SMALL(IF('quantities report'!$A$2:$A$10003=W$6,ROW('quantities report'!$A$2:$A$10003)-1,\"\"),ROWS($B$8:$B19))),\"0\"))","v":""},{"$f":"IF($B19=\"\",\"\",IFERROR(INDEX('quantities report'!$D$2:$D$10003,SMALL(IF('quantities report'!$A$2:$A$10003=X$6,ROW('quantities report'!$A$2:$A$10003)-1,\"\"),ROWS($B$8:$B19))),\"0\"))","v":""},{"$f":"IF($B19=\"\",\"\",IFERROR(INDEX('quantities report'!$D$2:$D$10003,SMALL(IF('quantities report'!$A$2:$A$10003=Y$6,ROW('quantities report'!$A$2:$A$10003)-1,\"\"),ROWS($B$8:$B19))),\"0\"))","v":""},{"$f":"IF($B19=\"\",\"\",IFERROR(INDEX('quantities report'!$D$2:$D$10003,SMALL(IF('quantities report'!$A$2:$A$10003=Z$6,ROW('quantities report'!$A$2:$A$10003)-1,\"\"),ROWS($B$8:$B19))),\"0\"))","v":""},{"$f":"IF($B19=\"\",\"\",Removals!$G16)","v":""},{"$f":"IF($B19=\"\",\"\",Removals!$L16)","v":""},{"$f":"IF($B19=\"\",\"\",IFERROR(INDEX('quantities report'!$D$2:$D$10003,SMALL(IF('quantities report'!$A$2:$A$10003=AC$6,ROW('quantities report'!$A$2:$A$10003)-1,\"\"),ROWS($B$8:$B19))),\"0\"))","v":""},{"$f":"IF($B19=\"\",\"\",IFERROR(INDEX('quantities report'!$D$2:$D$10003,SMALL(IF('quantities report'!$A$2:$A$10003=AD$6,ROW('quantities report'!$A$2:$A$10003)-1,\"\"),ROWS($B$8:$B19))),\"0\"))","v":""},{"$f":"IF($B19=\"\",\"\",IFERROR(INDEX('quantities report'!$D$2:$D$10003,SMALL(IF('quantities report'!$A$2:$A$10003=AE$6,ROW('quantities report'!$A$2:$A$10003)-1,\"\"),ROWS($B$8:$B19))),\"0\"))","v":""},{"$f":"IF($B19=\"\",\"\",IFERROR(INDEX('quantities report'!$D$2:$D$10003,SMALL(IF('quantities report'!$A$2:$A$10003=AF$6,ROW('quantities report'!$A$2:$A$10003)-1,\"\"),ROWS($B$8:$B19))),\"0\"))","v":""},{"$f":"IF($B19=\"\",\"\",IFERROR(INDEX('quantities report'!$D$2:$D$10003,SMALL(IF('quantities report'!$A$2:$A$10003=AG$6,ROW('quantities report'!$A$2:$A$10003)-1,\"\"),ROWS($B$8:$B19))),\"0\"))","v":""},{"$f":"IF($B19=\"\",\"\",IFERROR(INDEX('quantities report'!$D$2:$D$10003,SMALL(IF('quantities report'!$A$2:$A$10003=AH$6,ROW('quantities report'!$A$2:$A$10003)-1,\"\"),ROWS($B$8:$B19))),\"0\"))","v":""},"","","","","",0.9,"",""]
[null,{"$f":"IFERROR(INDEX('manual inputs'!M:M,SMALL(IF('manual inputs'!M:M<>\"\",ROW('manual inputs'!M:M)),ROW(15:15))),\"\")","v":""},{"$f":"IF(B20=\"\",\"\",IFERROR(INDEX('quantities report'!$D$2:$D$10003,SMALL(IF('quantities report'!$A$2:$A$10003=C$6,ROW('quantities report'!$A$2:$A$10003)-1,\"\"),ROWS($B$8:$B20))),\"0\"))","v":""},"",null,"",{"$f":"IF($B20=\"\",\"\",Structure_Ex!I20)","v":""},null,{"$f":"IF($B20=\"\",\"\",IFERROR(INDEX('quantities report'!$D$2:$D$10003,SMALL(IF('quantities report'!$A$2:$A$10003=I$6,ROW('quantities report'!$A$2:$A$10003)-1,\"\"),ROWS($B$8:$B20))),\"0\"))","v":""},{"$f":"IF($B20=\"\",\"\",Removals!$F17)","v":""},{"$f":"IF($B20=\"\",\"\",Removals!$K17)","v":""},{"$f":"IF($B20=\"\",\"\",IFERROR(INDEX('quantities report'!$D$2:$D$10003,SMALL(IF('quantities report'!$A$2:$A$10003=L$6,ROW('quantities report'!$A$2:$A$10003)-1,\"\"),ROWS($B$8:$B20))),\"0\"))","v":""},{"$f":"IF(B20=\"\",\"\",LOOKUP(B20,'manual inputs'!$B$4:$B$22,'manual inputs'!$D$4:$D$22))","v":""},"",{"$f":"IF($B20=\"\",\"\",IFERROR(INDEX('quantities report'!$D$2:$D$10003,SMALL(IF('quantities report'!$A$2:$A$10003=O$6,ROW('quantities report'!$A$2:$A$10003)-1,\"\"),ROWS($B$8:$B20))),\"0\"))","v":""},"",null,"",{"$f":"IF($B20=\"\",\"\",IFERROR(INDEX('quantities report'!$D$2:$D$10003,SMALL(IF('quantities report'!$A$2:$A$10003=S$6,ROW('quantities report'!$A$2:$A$10003)-1,\"\"),ROWS($B$8:$B20))),\"0\"))","v":""},{"$f":"IF($B20=\"\",\"\",IFERROR(INDEX('quantities report'!$D$2:$D$10003,SMALL(IF('quantities report'!$A$2:$A$10003=T$6,ROW('quantities report'!$A$2:$A$10003)-1,\"\"),ROWS($B$8:$B20))),\"0\"))","v":""},{"$f":"IF($B20=\"\",\"\",IFERROR(INDEX('quantities report'!$D$2:$D$10003,SMALL(IF('quantities report'!$A$2:$A$10003=U$6,ROW('quantities report'!$A$2:$A$10003)-1,\"\"),ROWS($B$8:$B20))),\"0\"))","v":""},{"$f":"IF($B20=\"\",\"\",IFERROR(INDEX('quantities report'!$D$2:$D$10003,SMALL(IF('quantities report'!$A$2:$A$10003=V$6,ROW('quantities report'!$A$2:$A$10003)-1,\"\"),ROWS($B$8:$B20))),\"0\"))","v":""},{"$f":"IF($B20=\"\",\"\",IFERROR(INDEX('quantities report'!$D$2:$D$10003,SMALL(IF('quantities report'!$A$2:$A$10003=W$6,ROW('quantities report'!$A$2:$A$10003)-1,\"\"),ROWS($B$8:$B20))),\"0\"))","v":""},{"$f":"IF($B20=\"\",\"\",IFERROR(INDEX('quantities report'!$D$2:$D$10003,SMALL(IF('quantities report'!$A$2:$A$10003=X$6,ROW('quantities report'!$A$2:$A$10003)-1,\"\"),ROWS($B$8:$B20))),\"0\"))","v":""},{"$f":"IF($B20=\"\",\"\",IFERROR(INDEX('quantities report'!$D$2:$D$10003,SMALL(IF('quantities report'!$A$2:$A$10003=Y$6,ROW('quantities report'!$A$2:$A$10003)-1,\"\"),ROWS($B$8:$B20))),\"0\"))","v":""},{"$f":"IF($B20=\"\",\"\",IFERROR(INDEX('quantities report'!$D$2:$D$10003,SMALL(IF('quantities report'!$A$2:$A$10003=Z$6,ROW('quantities report'!$A$2:$A$10003)-1,\"\"),ROWS($B$8:$B20))),\"0\"))","v":""},{"$f":"IF($B20=\"\",\"\",Removals!$G17)","v":""},{"$f":"IF($B20=\"\",\"\",Removals!$L17)","v":""},{"$f":"IF($B20=\"\",\"\",IFERROR(INDEX('quantities report'!$D$2:$D$10003,SMALL(IF('quantities report'!$A$2:$A$10003=AC$6,ROW('quantities report'!$A$2:$A$10003)-1,\"\"),ROWS($B$8:$B20))),\"0\"))","v":""},{"$f":"IF($B20=\"\",\"\",IFERROR(INDEX('quantities report'!$D$2:$D$10003,SMALL(IF('quantities report'!$A$2:$A$10003=AD$6,ROW('quantities report'!$A$2:$A$10003)-1,\"\"),ROWS($B$8:$B20))),\"0\"))","v":""},{"$f":"IF($B20=\"\",\"\",IFERROR(INDEX('quantities report'!$D$2:$D$10003,SMALL(IF('quantities report'!$A$2:$A$10003=AE$6,ROW('quantities report'!$A$2:$A$10003)-1,\"\"),ROWS($B$8:$B20))),\"0\"))","v":""},{"$f":"IF($B20=\"\",\"\",IFERROR(INDEX('quantities report'!$D$2:$D$10003,SMALL(IF('quantities report'!$A$2:$A$10003=AF$6,ROW('quantities report'!$A$2:$A$10003)-1,\"\"),ROWS($B$8:$B20))),\"0\"))","v":""},{"$f":"IF($B20=\"\",\"\",IFERROR(INDEX('quantities report'!$D$2:$D$10003,SMALL(IF('quantities report'!$A$2:$A$10003=AG$6,ROW('quantities report'!$A$2:$A$10003)-1,\"\"),ROWS($B$8:$B20))),\"0\"))","v":""},{"$f":"IF($B20=\"\",\"\",IFERROR(INDEX('quantities report'!$D$2:$D$10003,SMALL(IF('quantities report'!$A$2:$A$10003=AH$6,ROW('quantities report'!$A$2:$A$10003)-1,\"\"),ROWS($B$8:$B20))),\"0\"))","v":""},"","","","","",0.9,"",""]
[null,{"$f":"IFERROR(INDEX('manual inputs'!M:M,SMALL(IF('manual inputs'!M:M<>\"\",ROW('manual inputs'!M:M)),ROW(16:16))),\"\")","v":""},{"$f":"IF(B21=\"\",\"\",IFERROR(INDEX('quantities report'!$D$2:$D$10003,SMALL(IF('quantities report'!$A$2:$A$10003=C$6,ROW('quantities report'!$A$2:$A$10003)-1,\"\"),ROWS($B$8:$B21))),\"0\"))","v":""},"",null,"",{"$f":"IF($B21=\"\",\"\",Structure_Ex!I21)","v":""},null,{"$f":"IF($B21=\"\",\"\",IFERROR(INDEX('quantities report'!$D$2:$D$10003,SMALL(IF('quantities report'!$A$2:$A$10003=I$6,ROW('quantities report'!$A$2:$A$10003)-1,\"\"),ROWS($B$8:$B21))),\"0\"))","v":""},{"$f":"IF($B21=\"\",\"\",Removals!$F18)","v":""},{"$f":"IF($B21=\"\",\"\",Removals!$K18)","v":""},{"$f":"IF($B21=\"\",\"\",IFERROR(INDEX('quantities report'!$D$2:$D$10003,SMALL(IF('quantities report'!$A$2:$A$10003=L$6,ROW('quantities report'!$A$2:$A$10003)-1,\"\"),ROWS($B$8:$B21))),\"0\"))","v":""},{"$f":"IF(B21=\"\",\"\",LOOKUP(B21,'manual inputs'!$B$4:$B$22,'manual inputs'!$D$4:$D$22))","v":""},"",{"$f":"IF($B21=\"\",\"\",IFERROR(INDEX('quantities report'!$D$2:$D$10003,SMALL(IF('quantities report'!$A$2:$A$10003=O$6,ROW('quantities report'!$A$2:$A$10003)-1,\"\"),ROWS($B$8:$B21))),\"0\"))","v":""},"",null,"",{"$f":"IF($B21=\"\",\"\",IFERROR(INDEX('quantities report'!$D$2:$D$10003,SMALL(IF('quantities report'!$A$2:$A$10003=S$6,ROW('quantities report'!$A$2:$A$10003)-1,\"\"),ROWS($B$8:$B21))),\"0\"))","v":""},{"$f":"IF($B21=\"\",\"\",IFERROR(INDEX('quantities report'!$D$2:$D$10003,SMALL(IF('quantities report'!$A$2:$A$10003=T$6,ROW('quantities report'!$A$2:$A$10003)-1,\"\"),ROWS($B$8:$B21))),\"0\"))","v":""},{"$f":"IF($B21=\"\",\"\",IFERROR(INDEX('quantities report'!$D$2:$D$10003,SMALL(IF('quantities report'!$A$2:$A$10003=U$6,ROW('quantities report'!$A$2:$A$10003)-1,\"\"),ROWS($B$8:$B21))),\"0\"))","v":""},{"$f":"IF($B21=\"\",\"\",IFERROR(INDEX('quantities report'!$D$2:$D$10003,SMALL(IF('quantities report'!$A$2:$A$10003=V$6,ROW('quantities report'!$A$2:$A$10003)-1,\"\"),ROWS($B$8:$B21))),\"0\"))","v":""},{"$f":"IF($B21=\"\",\"\",IFERROR(INDEX('quantities report'!$D$2:$D$10003,SMALL(IF('quantities report'!$A$2:$A$10003=W$6,ROW('quantities report'!$A$2:$A$10003)-1,\"\"),ROWS($B$8:$B21))),\"0\"))","v":""},{"$f":"IF($B21=\"\",\"\",IFERROR(INDEX('quantities report'!$D$2:$D$10003,SMALL(IF('quantities report'!$A$2:$A$10003=X$6,ROW('quantities report'!$A$2:$A$10003)-1,\"\"),ROWS($B$8:$B21))),\"0\"))","v":""},{"$f":"IF($B21=\"\",\"\",IFERROR(INDEX('quantities report'!$D$2:$D$10003,SMALL(IF('quantities report'!$A$2:$A$10003=Y$6,ROW('quantities report'!$A$2:$A$10003)-1,\"\"),ROWS($B$8:$B21))),\"0\"))","v":""},{"$f":"IF($B21=\"\",\"\",IFERROR(INDEX('quantities report'!$D$2:$D$10003,SMALL(IF('quantities report'!$A$2:$A$10003=Z$6,ROW('quantities report'!$A$2:$A$10003)-1,\"\"),ROWS($B$8:$B21))),\"0\"))","v":""},{"$f":"IF($B21=\"\",\"\",Removals!$G18)","v":""},{"$f":"IF($B21=\"\",\"\",Removals!$L18)","v":""},{"$f":"IF($B21=\"\",\"\",IFERROR(INDEX('quantities report'!$D$2:$D$10003,SMALL(IF('quantities report'!$A$2:$A$10003=AC$6,ROW('quantities report'!$A$2:$A$10003)-1,\"\"),ROWS($B$8:$B21))),\"0\"))","v":""},{"$f":"IF($B21=\"\",\"\",IFERROR(INDEX('quantities report'!$D$2:$D$10003,SMALL(IF('quantities report'!$A$2:$A$10003=AD$6,ROW('quantities report'!$A$2:$A$10003)-1,\"\"),ROWS($B$8:$B21))),\"0\"))","v":""},{"$f":"IF($B21=\"\",\"\",IFERROR(INDEX('quantities report'!$D$2:$D$10003,SMALL(IF('quantities report'!$A$2:$A$10003=AE$6,ROW('quantities report'!$A$2:$A$10003)-1,\"\"),ROWS($B$8:$B21))),\"0\"))","v":""},{"$f":"IF($B21=\"\",\"\",IFERROR(INDEX('quantities report'!$D$2:$D$10003,SMALL(IF('quantities report'!$A$2:$A$10003=AF$6,ROW('quantities report'!$A$2:$A$10003)-1,\"\"),ROWS($B$8:$B21))),\"0\"))","v":""},{"$f":"IF($B21=\"\",\"\",IFERROR(INDEX('quantities report'!$D$2:$D$10003,SMALL(IF('quantities report'!$A$2:$A$10003=AG$6,ROW('quantities report'!$A$2:$A$10003)-1,\"\"),ROWS($B$8:$B21))),\"0\"))","v":""},{"$f":"IF($B21=\"\",\"\",IFERROR(INDEX('quantities report'!$D$2:$D$10003,SMALL(IF('quantities report'!$A$2:$A$10003=AH$6,ROW('quantities report'!$A$2:$A$10003)-1,\"\"),ROWS($B$8:$B21))),\"0\"))","v":""},"","","","","",0.9,"",""]
[null,{"$f":"IFERROR(INDEX('manual inputs'!M:M,SMALL(IF('manual inputs'!M:M<>\"\",ROW('manual inputs'!M:M)),ROW(17:17))),\"\")","v":""},{"$f":"IF(B22=\"\",\"\",IFERROR(INDEX('quantities report'!$D$2:$D$10003,SMALL(IF('quantities report'!$A$2:$A$10003=C$6,ROW('quantities report'!$A$2:$A$10003)-1,\"\"),ROWS($B$8:$B22))),\"0\"))","v":""},"",null,"",{"$f":"IF($B22=\"\",\"\",Structure_Ex!I22)","v":""},null,{"$f":"IF($B22=\"\",\"\",IFERROR(INDEX('quantities report'!$D$2:$D$10003,SMALL(IF('quantities report'!$A$2:$A$10003=I$6,ROW('quantities report'!$A$2:$A$10003)-1,\"\"),ROWS($B$8:$B22))),\"0\"))","v":""},{"$f":"IF($B22=\"\",\"\",Removals!$F19)","v":""},{"$f":"IF($B22=\"\",\"\",Removals!$K19)","v":""},{"$f":"IF($B22=\"\",\"\",IFERROR(INDEX('quantities report'!$D$2:$D$10003,SMALL(IF('quantities report'!$A$2:$A$10003=L$6,ROW('quantities report'!$A$2:$A$10003)-1,\"\"),ROWS($B$8:$B22))),\"0\"))","v":""},{"$f":"IF(B22=\"\",\"\",LOOKUP(B22,'manual inputs'!$B$4:$B$22,'manual inputs'!$D$4:$D$22))","v":""},"",{"$f":"IF($B22=\"\",\"\",IFERROR(INDEX('quantities report'!$D$2:$D$10003,SMALL(IF('quantities report'!$A$2:$A$10003=O$6,ROW('quantities report'!$A$2:$A$10003)-1,\"\"),ROWS($B$8:$B22))),\"0\"))","v":""},"",null,"",{"$f":"IF($B22=\"\",\"\",IFERROR(INDEX('quantities report'!$D$2:$D$10003,SMALL(IF('quantities report'!$A$2:$A$10003=S$6,ROW('quantities report'!$A$2:$A$10003)-1,\"\"),ROWS($B$8:$B22))),\"0\"))","v":""},{"$f":"IF($B22=\"\",\"\",IFERROR(INDEX('quantities report'!$D$2:$D$10003,SMALL(IF('quantities report'!$A$2:$A$10003=T$6,ROW('quantities report'!$A$2:$A$10003)-1,\"\"),ROWS($B$8:$B22))),\"0\"))","v":""},{"$f":"IF($B22=\"\",\"\",IFERROR(INDEX('quantities report'!$D$2:$D$10003,SMALL(IF('quantities report'!$A$2:$A$10003=U$6,ROW('quantities report'!$A$2:$A$10003)-1,\"\"),ROWS($B$8:$B22))),\"0\"))","v":""},{"$f":"IF($B22=\"\",\"\",IFERROR(INDEX('quantities report'!$D$2:$D$10003,SMALL(IF('quantities report'!$A$2:$A$10003=V$6,ROW('quantities report'!$A$2:$A$10003)-1,\"\"),ROWS($B$8:$B22))),\"0\"))","v":""},{"$f":"IF($B22=\"\",\"\",IFERROR(INDEX('quantities report'!$D$2:$D$10003,SMALL(IF('quantities report'!$A$2:$A$10003=W$6,ROW('quantities report'!$A$2:$A$10003)-1,\"\"),ROWS($B$8:$B22))),\"0\"))","v":""},{"$f":"IF($B22=\"\",\"\",IFERROR(INDEX('quantities report'!$D$2:$D$10003,SMALL(IF('quantities report'!$A$2:$A$10003=X$6,ROW('quantities report'!$A$2:$A$10003)-1,\"\"),ROWS($B$8:$B22))),\"0\"))","v":""},{"$f":"IF($B22=\"\",\"\",IFERROR(INDEX('quantities report'!$D$2:$D$10003,SMALL(IF('quantities report'!$A$2:$A$10003=Y$6,ROW('quantities report'!$A$2:$A$10003)-1,\"\"),ROWS($B$8:$B22))),\"0\"))","v":""},{"$f":"IF($B22=\"\",\"\",IFERROR(INDEX('quantities report'!$D$2:$D$10003,SMALL(IF('quantities report'!$A$2:$A$10003=Z$6,ROW('quantities report'!$A$2:$A$10003)-1,\"\"),ROWS($B$8:$B22))),\"0\"))","v":""},{"$f":"IF($B22=\"\",\"\",Removals!$G19)","v":""},{"$f":"IF($B22=\"\",\"\",Removals!$L19)","v":""},{"$f":"IF($B22=\"\",\"\",IFERROR(INDEX('quantities report'!$D$2:$D$10003,SMALL(IF('quantities report'!$A$2:$A$10003=AC$6,ROW('quantities report'!$A$2:$A$10003)-1,\"\"),ROWS($B$8:$B22))),\"0\"))","v":""},{"$f":"IF($B22=\"\",\"\",IFERROR(INDEX('quantities report'!$D$2:$D$10003,SMALL(IF('quantities report'!$A$2:$A$10003=AD$6,ROW('quantities report'!$A$2:$A$10003)-1,\"\"),ROWS($B$8:$B22))),\"0\"))","v":""},{"$f":"IF($B22=\"\",\"\",IFERROR(INDEX('quantities report'!$D$2:$D$10003,SMALL(IF('quantities report'!$A$2:$A$10003=AE$6,ROW('quantities report'!$A$2:$A$10003)-1,\"\"),ROWS($B$8:$B22))),\"0\"))","v":""},{"$f":"IF($B22=\"\",\"\",IFERROR(INDEX('quantities report'!$D$2:$D$10003,SMALL(IF('quantities report'!$A$2:$A$10003=AF$6,ROW('quantities report'!$A$2:$A$10003)-1,\"\"),ROWS($B$8:$B22))),\"0\"))","v":""},{"$f":"IF($B22=\"\",\"\",IFERROR(INDEX('quantities report'!$D$2:$D$10003,SMALL(IF('quantities report'!$A$2:$A$10003=AG$6,ROW('quantities report'!$A$2:$A$10003)-1,\"\"),ROWS($B$8:$B22))),\"0\"))","v":""},{"$f":"IF($B22=\"\",\"\",IFERROR(INDEX('quantities report'!$D$2:$D$10003,SMALL(IF('quantities report'!$A$2:$A$10003=AH$6,ROW('quantities report'!$A$2:$A$10003)-1,\"\"),ROWS($B$8:$B22))),\"0\"))","v":""},"","","","","",0.9,"",""]
[null,{"$f":"IFERROR(INDEX('manual inputs'!M:M,SMALL(IF('manual inputs'!M:M<>\"\",ROW('manual inputs'!M:M)),ROW(18:18))),\"\")","v":""},{"$f":"IF(B23=\"\",\"\",IFERROR(INDEX('quantities report'!$D$2:$D$10003,SMALL(IF('quantities report'!$A$2:$A$10003=C$6,ROW('quantities report'!$A$2:$A$10003)-1,\"\"),ROWS($B$8:$B23))),\"0\"))","v":""},"",null,"",{"$f":"IF($B23=\"\",\"\",Structure_Ex!I23)","v":""},null,{"$f":"IF($B23=\"\",\"\",IFERROR(INDEX('quantities report'!$D$2:$D$10003,SMALL(IF('quantities report'!$A$2:$A$10003=I$6,ROW('quantities report'!$A$2:$A$10003)-1,\"\"),ROWS($B$8:$B23))),\"0\"))","v":""},{"$f":"IF($B23=\"\",\"\",Removals!$F20)","v":""},{"$f":"IF($B23=\"\",\"\",Removals!$K20)","v":""},{"$f":"IF($B23=\"\",\"\",IFERROR(INDEX('quantities report'!$D$2:$D$10003,SMALL(IF('quantities report'!$A$2:$A$10003=L$6,ROW('quantities report'!$A$2:$A$10003)-1,\"\"),ROWS($B$8:$B23))),\"0\"))","v":""},{"$f":"IF(B23=\"\",\"\",LOOKUP(B23,'manual inputs'!$B$4:$B$22,'manual inputs'!$D$4:$D$22))","v":""},"",{"$f":"IF($B23=\"\",\"\",IFERROR(INDEX('quantities report'!$D$2:$D$10003,SMALL(IF('quantities report'!$A$2:$A$10003=O$6,ROW('quantities report'!$A$2:$A$10003)-1,\"\"),ROWS($B$8:$B23))),\"0\"))","v":""},"",null,"",{"$f":"IF($B23=\"\",\"\",IFERROR(INDEX('quantities report'!$D$2:$D$10003,SMALL(IF('quantities report'!$A$2:$A$10003=S$6,ROW('quantities report'!$A$2:$A$10003)-1,\"\"),ROWS($B$8:$B23))),\"0\"))","v":""},{"$f":"IF($B23=\"\",\"\",IFERROR(INDEX('quantities report'!$D$2:$D$10003,SMALL(IF('quantities report'!$A$2:$A$10003=T$6,ROW('quantities report'!$A$2:$A$10003)-1,\"\"),ROWS($B$8:$B23))),\"0\"))","v":""},{"$f":"IF($B23=\"\",\"\",IFERROR(INDEX('quantities report'!$D$2:$D$10003,SMALL(IF('quantities report'!$A$2:$A$10003=U$6,ROW('quantities report'!$A$2:$A$10003)-1,\"\"),ROWS($B$8:$B23))),\"0\"))","v":""},{"$f":"IF($B23=\"\",\"\",IFERROR(INDEX('quantities report'!$D$2:$D$10003,SMALL(IF('quantities report'!$A$2:$A$10003=V$6,ROW('quantities report'!$A$2:$A$10003)-1,\"\"),ROWS($B$8:$B23))),\"0\"))","v":""},{"$f":"IF($B23=\"\",\"\",IFERROR(INDEX('quantities report'!$D$2:$D$10003,SMALL(IF('quantities report'!$A$2:$A$10003=W$6,ROW('quantities report'!$A$2:$A$10003)-1,\"\"),ROWS($B$8:$B23))),\"0\"))","v":""},{"$f":"IF($B23=\"\",\"\",IFERROR(INDEX('quantities report'!$D$2:$D$10003,SMALL(IF('quantities report'!$A$2:$A$10003=X$6,ROW('quantities report'!$A$2:$A$10003)-1,\"\"),ROWS($B$8:$B23))),\"0\"))","v":""},{"$f":"IF($B23=\"\",\"\",IFERROR(INDEX('quantities report'!$D$2:$D$10003,SMALL(IF('quantities report'!$A$2:$A$10003=Y$6,ROW('quantities report'!$A$2:$A$10003)-1,\"\"),ROWS($B$8:$B23))),\"0\"))","v":""},{"$f":"IF($B23=\"\",\"\",IFERROR(INDEX('quantities report'!$D$2:$D$10003,SMALL(IF('quantities report'!$A$2:$A$10003=Z$6,ROW('quantities report'!$A$2:$A$10003)-1,\"\"),ROWS($B$8:$B23))),\"0\"))","v":""},{"$f":"IF($B23=\"\",\"\",Removals!$G20)","v":""},{"$f":"IF($B23=\"\",\"\",Removals!$L20)","v":""},{"$f":"IF($B23=\"\",\"\",IFERROR(INDEX('quantities report'!$D$2:$D$10003,SMALL(IF('quantities report'!$A$2:$A$10003=AC$6,ROW('quantities report'!$A$2:$A$10003)-1,\"\"),ROWS($B$8:$B23))),\"0\"))","v":""},{"$f":"IF($B23=\"\",\"\",IFERROR(INDEX('quantities report'!$D$2:$D$10003,SMALL(IF('quantities report'!$A$2:$A$10003=AD$6,ROW('quantities report'!$A$2:$A$10003)-1,\"\"),ROWS($B$8:$B23))),\"0\"))","v":""},{"$f":"IF($B23=\"\",\"\",IFERROR(INDEX('quantities report'!$D$2:$D$10003,SMALL(IF('quantities report'!$A$2:$A$10003=AE$6,ROW('quantities report'!$A$2:$A$10003)-1,\"\"),ROWS($B$8:$B23))),\"0\"))","v":""},{"$f":"IF($B23=\"\",\"\",IFERROR(INDEX('quantities report'!$D$2:$D$10003,SMALL(IF('quantities report'!$A$2:$A$10003=AF$6,ROW('quantities report'!$A$2:$A$10003)-1,\"\"),ROWS($B$8:$B23))),\"0\"))","v":""},{"$f":"IF($B23=\"\",\"\",IFERROR(INDEX('quantities report'!$D$2:$D$10003,SMALL(IF('quantities report'!$A$2:$A$10003=AG$6,ROW('quantities report'!$A$2:$A$10003)-1,\"\"),ROWS($B$8:$B23))),\"0\"))","v":""},{"$f":"IF($B23=\"\",\"\",IFERROR(INDEX('quantities report'!$D$2:$D$10003,SMALL(IF('quantities report'!$A$2:$A$10003=AH$6,ROW('quantities report'!$A$2:$A$10003)-1,\"\"),ROWS($B$8:$B23))),\"0\"))","v":""},"","","","","",0.9,"",""]
[null,{"$f":"IFERROR(INDEX('manual inputs'!M:M,SMALL(IF('manual inputs'!M:M<>\"\",ROW('manual inputs'!M:M)),ROW(19:19))),\"\")","v":""},{"$f":"IF(B24=\"\",\"\",IFERROR(INDEX('quantities report'!$D$2:$D$10003,SMALL(IF('quantities report'!$A$2:$A$10003=C$6,ROW('quantities report'!$A$2:$A$10003)-1,\"\"),ROWS($B$8:$B24))),\"0\"))","v":""},"",null,"",{"$f":"IF($B24=\"\",\"\",Structure_Ex!I24)","v":""},null,{"$f":"IF($B24=\"\",\"\",IFERROR(INDEX('quantities report'!$D$2:$D$10003,SMALL(IF('quantities report'!$A$2:$A$10003=I$6,ROW('quantities report'!$A$2:$A$10003)-1,\"\"),ROWS($B$8:$B24))),\"0\"))","v":""},{"$f":"IF($B24=\"\",\"\",Removals!$F21)","v":""},{"$f":"IF($B24=\"\",\"\",Removals!$K21)","v":""},{"$f":"IF($B24=\"\",\"\",IFERROR(INDEX('quantities report'!$D$2:$D$10003,SMALL(IF('quantities report'!$A$2:$A$10003=L$6,ROW('quantities report'!$A$2:$A$10003)-1,\"\"),ROWS($B$8:$B24))),\"0\"))","v":""},{"$f":"IF(B24=\"\",\"\",LOOKUP(B24,'manual inputs'!$B$4:$B$22,'manual inputs'!$D$4:$D$22))","v":""},"",{"$f":"IF($B24=\"\",\"\",IFERROR(INDEX('quantities report'!$D$2:$D$10003,SMALL(IF('quantities report'!$A$2:$A$10003=O$6,ROW('quantities report'!$A$2:$A$10003)-1,\"\"),ROWS($B$8:$B24))),\"0\"))","v":""},"",null,"",{"$f":"IF($B24=\"\",\"\",IFERROR(INDEX('quantities report'!$D$2:$D$10003,SMALL(IF('quantities report'!$A$2:$A$10003=S$6,ROW('quantities report'!$A$2:$A$10003)-1,\"\"),ROWS($B$8:$B24))),\"0\"))","v":""},{"$f":"IF($B24=\"\",\"\",IFERROR(INDEX('quantities report'!$D$2:$D$10003,SMALL(IF('quantities report'!$A$2:$A$10003=T$6,ROW('quantities report'!$A$2:$A$10003)-1,\"\"),ROWS($B$8:$B24))),\"0\"))","v":""},{"$f":"IF($B24=\"\",\"\",IFERROR(INDEX('quantities report'!$D$2:$D$10003,SMALL(IF('quantities report'!$A$2:$A$10003=U$6,ROW('quantities report'!$A$2:$A$10003)-1,\"\"),ROWS($B$8:$B24))),\"0\"))","v":""},{"$f":"IF($B24=\"\",\"\",IFERROR(INDEX('quantities report'!$D$2:$D$10003,SMALL(IF('quantities report'!$A$2:$A$10003=V$6,ROW('quantities report'!$A$2:$A$10003)-1,\"\"),ROWS($B$8:$B24))),\"0\"))","v":""},{"$f":"IF($B24=\"\",\"\",IFERROR(INDEX('quantities report'!$D$2:$D$10003,SMALL(IF('quantities report'!$A$2:$A$10003=W$6,ROW('quantities report'!$A$2:$A$10003)-1,\"\"),ROWS($B$8:$B24))),\"0\"))","v":""},{"$f":"IF($B24=\"\",\"\",IFERROR(INDEX('quantities report'!$D$2:$D$10003,SMALL(IF('quantities report'!$A$2:$A$10003=X$6,ROW('quantities report'!$A$2:$A$10003)-1,\"\"),ROWS($B$8:$B24))),\"0\"))","v":""},{"$f":"IF($B24=\"\",\"\",IFERROR(INDEX('quantities report'!$D$2:$D$10003,SMALL(IF('quantities report'!$A$2:$A$10003=Y$6,ROW('quantities report'!$A$2:$A$10003)-1,\"\"),ROWS($B$8:$B24))),\"0\"))","v":""},{"$f":"IF($B24=\"\",\"\",IFERROR(INDEX('quantities report'!$D$2:$D$10003,SMALL(IF('quantities report'!$A$2:$A$10003=Z$6,ROW('quantities report'!$A$2:$A$10003)-1,\"\"),ROWS($B$8:$B24))),\"0\"))","v":""},{"$f":"IF($B24=\"\",\"\",Removals!$G21)","v":""},{"$f":"IF($B24=\"\",\"\",Removals!$L21)","v":""},{"$f":"IF($B24=\"\",\"\",IFERROR(INDEX('quantities report'!$D$2:$D$10003,SMALL(IF('quantities report'!$A$2:$A$10003=AC$6,ROW('quantities report'!$A$2:$A$10003)-1,\"\"),ROWS($B$8:$B24))),\"0\"))","v":""},{"$f":"IF($B24=\"\",\"\",IFERROR(INDEX('quantities report'!$D$2:$D$10003,SMALL(IF('quantities report'!$A$2:$A$10003=AD$6,ROW('quantities report'!$A$2:$A$10003)-1,\"\"),ROWS($B$8:$B24))),\"0\"))","v":""},{"$f":"IF($B24=\"\",\"\",IFERROR(INDEX('quantities report'!$D$2:$D$10003,SMALL(IF('quantities report'!$A$2:$A$10003=AE$6,ROW('quantities report'!$A$2:$A$10003)-1,\"\"),ROWS($B$8:$B24))),\"0\"))","v":""},{"$f":"IF($B24=\"\",\"\",IFERROR(INDEX('quantities report'!$D$2:$D$10003,SMALL(IF('quantities report'!$A$2:$A$10003=AF$6,ROW('quantities report'!$A$2:$A$10003)-1,\"\"),ROWS($B$8:$B24))),\"0\"))","v":""},{"$f":"IF($B24=\"\",\"\",IFERROR(INDEX('quantities report'!$D$2:$D$10003,SMALL(IF('quantities report'!$A$2:$A$10003=AG$6,ROW('quantities report'!$A$2:$A$10003)-1,\"\"),ROWS($B$8:$B24))),\"0\"))","v":""},{"$f":"IF($B24=\"\",\"\",IFERROR(INDEX('quantities report'!$D$2:$D$10003,SMALL(IF('quantities report'!$A$2:$A$10003=AH$6,ROW('quantities report'!$A$2:$A$10003)-1,\"\"),ROWS($B$8:$B24))),\"0\"))","v":""},"","","","","",0.9,"",""]
[null,{"$f":"IFERROR(INDEX('manual inputs'!M:M,SMALL(IF('manual inputs'!M:M<>\"\",ROW('manual inputs'!M:M)),ROW(20:20))),\"\")","v":""},{"$f":"IF(B25=\"\",\"\",IFERROR(INDEX('quantities report'!$D$2:$D$10003,SMALL(IF('quantities report'!$A$2:$A$10003=C$6,ROW('quantities report'!$A$2:$A$10003)-1,\"\"),ROWS($B$8:$B25))),\"0\"))","v":""},"",null,"",{"$f":"IF($B25=\"\",\"\",Structure_Ex!I25)","v":""},null,{"$f":"IF($B25=\"\",\"\",IFERROR(INDEX('quantities report'!$D$2:$D$10003,SMALL(IF('quantities report'!$A$2:$A$10003=I$6,ROW('quantities report'!$A$2:$A$10003)-1,\"\"),ROWS($B$8:$B25))),\"0\"))","v":""},{"$f":"IF($B25=\"\",\"\",Removals!$F22)","v":""},{"$f":"IF($B25=\"\",\"\",Removals!$K22)","v":""},{"$f":"IF($B25=\"\",\"\",IFERROR(INDEX('quantities report'!$D$2:$D$10003,SMALL(IF('quantities report'!$A$2:$A$10003=L$6,ROW('quantities report'!$A$2:$A$10003)-1,\"\"),ROWS($B$8:$B25))),\"0\"))","v":""},{"$f":"IF(B25=\"\",\"\",LOOKUP(B25,'manual inputs'!$B$4:$B$22,'manual inputs'!$D$4:$D$22))","v":""},"",{"$f":"IF($B25=\"\",\"\",IFERROR(INDEX('quantities report'!$D$2:$D$10003,SMALL(IF('quantities report'!$A$2:$A$10003=O$6,ROW('quantities report'!$A$2:$A$10003)-1,\"\"),ROWS($B$8:$B25))),\"0\"))","v":""},"",null,"",{"$f":"IF($B25=\"\",\"\",IFERROR(INDEX('quantities report'!$D$2:$D$10003,SMALL(IF('quantities report'!$A$2:$A$10003=S$6,ROW('quantities report'!$A$2:$A$10003)-1,\"\"),ROWS($B$8:$B25))),\"0\"))","v":""},{"$f":"IF($B25=\"\",\"\",IFERROR(INDEX('quantities report'!$D$2:$D$10003,SMALL(IF('quantities report'!$A$2:$A$10003=T$6,ROW('quantities report'!$A$2:$A$10003)-1,\"\"),ROWS($B$8:$B25))),\"0\"))","v":""},{"$f":"IF($B25=\"\",\"\",IFERROR(INDEX('quantities report'!$D$2:$D$10003,SMALL(IF('quantities report'!$A$2:$A$10003=U$6,ROW('quantities report'!$A$2:$A$10003)-1,\"\"),ROWS($B$8:$B25))),\"0\"))","v":""},{"$f":"IF($B25=\"\",\"\",IFERROR(INDEX('quantities report'!$D$2:$D$10003,SMALL(IF('quantities report'!$A$2:$A$10003=V$6,ROW('quantities report'!$A$2:$A$10003)-1,\"\"),ROWS($B$8:$B25))),\"0\"))","v":""},{"$f":"IF($B25=\"\",\"\",IFERROR(INDEX('quantities report'!$D$2:$D$10003,SMALL(IF('quantities report'!$A$2:$A$10003=W$6,ROW('quantities report'!$A$2:$A$10003)-1,\"\"),ROWS($B$8:$B25))),\"0\"))","v":""},{"$f":"IF($B25=\"\",\"\",IFERROR(INDEX('quantities report'!$D$2:$D$10003,SMALL(IF('quantities report'!$A$2:$A$10003=X$6,ROW('quantities report'!$A$2:$A$10003)-1,\"\"),ROWS($B$8:$B25))),\"0\"))","v":""},{"$f":"IF($B25=\"\",\"\",IFERROR(INDEX('quantities report'!$D$2:$D$10003,SMALL(IF('quantities report'!$A$2:$A$10003=Y$6,ROW('quantities report'!$A$2:$A$10003)-1,\"\"),ROWS($B$8:$B25))),\"0\"))","v":""},{"$f":"IF($B25=\"\",\"\",IFERROR(INDEX('quantities report'!$D$2:$D$10003,SMALL(IF('quantities report'!$A$2:$A$10003=Z$6,ROW('quantities report'!$A$2:$A$10003)-1,\"\"),ROWS($B$8:$B25))),\"0\"))","v":""},{"$f":"IF($B25=\"\",\"\",Removals!$G22)","v":""},{"$f":"IF($B25=\"\",\"\",Removals!$L22)","v":""},{"$f":"IF($B25=\"\",\"\",IFERROR(INDEX('quantities report'!$D$2:$D$10003,SMALL(IF('quantities report'!$A$2:$A$10003=AC$6,ROW('quantities report'!$A$2:$A$10003)-1,\"\"),ROWS($B$8:$B25))),\"0\"))","v":""},{"$f":"IF($B25=\"\",\"\",IFERROR(INDEX('quantities report'!$D$2:$D$10003,SMALL(IF('quantities report'!$A$2:$A$10003=AD$6,ROW('quantities report'!$A$2:$A$10003)-1,\"\"),ROWS($B$8:$B25))),\"0\"))","v":""},{"$f":"IF($B25=\"\",\"\",IFERROR(INDEX('quantities report'!$D$2:$D$10003,SMALL(IF('quantities report'!$A$2:$A$10003=AE$6,ROW('quantities report'!$A$2:$A$10003)-1,\"\"),ROWS($B$8:$B25))),\"0\"))","v":""},{"$f":"IF($B25=\"\",\"\",IFERROR(INDEX('quantities report'!$D$2:$D$10003,SMALL(IF('quantities report'!$A$2:$A$10003=AF$6,ROW('quantities report'!$A$2:$A$10003)-1,\"\"),ROWS($B$8:$B25))),\"0\"))","v":""},{"$f":"IF($B25=\"\",\"\",IFERROR(INDEX('quantities report'!$D$2:$D$10003,SMALL(IF('quantities report'!$A$2:$A$10003=AG$6,ROW('quantities report'!$A$2:$A$10003)-1,\"\"),ROWS($B$8:$B25))),\"0\"))","v":""},{"$f":"IF($B25=\"\",\"\",IFERROR(INDEX('quantities report'!$D$2:$D$10003,SMALL(IF('quantities report'!$A$2:$A$10003=AH$6,ROW('quantities report'!$A$2:$A$10003)-1,\"\"),ROWS($B$8:$B25))),\"0\"))","v":""},"","","","","",0.9,"",""]
[null,{"$f":"IFERROR(INDEX('manual inputs'!M:M,SMALL(IF('manual inputs'!M:M<>\"\",ROW('manual inputs'!M:M)),ROW(21:21))),\"\")","v":""},{"$f":"IF(B26=\"\",\"\",IFERROR(INDEX('quantities report'!$D$2:$D$10003,SMALL(IF('quantities report'!$A$2:$A$10003=C$6,ROW('quantities report'!$A$2:$A$10003)-1,\"\"),ROWS($B$8:$B26))),\"0\"))","v":""},"",null,"",{"$f":"IF($B26=\"\",\"\",Structure_Ex!I26)","v":""},null,{"$f":"IF($B26=\"\",\"\",IFERROR(INDEX('quantities report'!$D$2:$D$10003,SMALL(IF('quantities report'!$A$2:$A$10003=I$6,ROW('quantities report'!$A$2:$A$10003)-1,\"\"),ROWS($B$8:$B26))),\"0\"))","v":""},{"$f":"IF($B26=\"\",\"\",Removals!$F23)","v":""},{"$f":"IF($B26=\"\",\"\",Removals!$K23)","v":""},{"$f":"IF($B26=\"\",\"\",IFERROR(INDEX('quantities report'!$D$2:$D$10003,SMALL(IF('quantities report'!$A$2:$A$10003=L$6,ROW('quantities report'!$A$2:$A$10003)-1,\"\"),ROWS($B$8:$B26))),\"0\"))","v":""},{"$f":"IF(B26=\"\",\"\",LOOKUP(B26,'manual inputs'!$B$4:$B$22,'manual inputs'!$D$4:$D$22))","v":""},"",{"$f":"IF($B26=\"\",\"\",IFERROR(INDEX('quantities report'!$D$2:$D$10003,SMALL(IF('quantities report'!$A$2:$A$10003=O$6,ROW('quantities report'!$A$2:$A$10003)-1,\"\"),ROWS($B$8:$B26))),\"0\"))","v":""},"",null,"",{"$f":"IF($B26=\"\",\"\",IFERROR(INDEX('quantities report'!$D$2:$D$10003,SMALL(IF('quantities report'!$A$2:$A$10003=S$6,ROW('quantities report'!$A$2:$A$10003)-1,\"\"),ROWS($B$8:$B26))),\"0\"))","v":""},{"$f":"IF($B26=\"\",\"\",IFERROR(INDEX('quantities report'!$D$2:$D$10003,SMALL(IF('quantities report'!$A$2:$A$10003=T$6,ROW('quantities report'!$A$2:$A$10003)-1,\"\"),ROWS($B$8:$B26))),\"0\"))","v":""},{"$f":"IF($B26=\"\",\"\",IFERROR(INDEX('quantities report'!$D$2:$D$10003,SMALL(IF('quantities report'!$A$2:$A$10003=U$6,ROW('quantities report'!$A$2:$A$10003)-1,\"\"),ROWS($B$8:$B26))),\"0\"))","v":""},{"$f":"IF($B26=\"\",\"\",IFERROR(INDEX('quantities report'!$D$2:$D$10003,SMALL(IF('quantities report'!$A$2:$A$10003=V$6,ROW('quantities report'!$A$2:$A$10003)-1,\"\"),ROWS($B$8:$B26))),\"0\"))","v":""},{"$f":"IF($B26=\"\",\"\",IFERROR(INDEX('quantities report'!$D$2:$D$10003,SMALL(IF('quantities report'!$A$2:$A$10003=W$6,ROW('quantities report'!$A$2:$A$10003)-1,\"\"),ROWS($B$8:$B26))),\"0\"))","v":""},{"$f":"IF($B26=\"\",\"\",IFERROR(INDEX('quantities report'!$D$2:$D$10003,SMALL(IF('quantities report'!$A$2:$A$10003=X$6,ROW('quantities report'!$A$2:$A$10003)-1,\"\"),ROWS($B$8:$B26))),\"0\"))","v":""},{"$f":"IF($B26=\"\",\"\",IFERROR(INDEX('quantities report'!$D$2:$D$10003,SMALL(IF('quantities report'!$A$2:$A$10003=Y$6,ROW('quantities report'!$A$2:$A$10003)-1,\"\"),ROWS($B$8:$B26))),\"0\"))","v":""},{"$f":"IF($B26=\"\",\"\",IFERROR(INDEX('quantities report'!$D$2:$D$10003,SMALL(IF('quantities report'!$A$2:$A$10003=Z$6,ROW('quantities report'!$A$2:$A$10003)-1,\"\"),ROWS($B$8:$B26))),\"0\"))","v":""},{"$f":"IF($B26=\"\",\"\",Removals!$G23)","v":""},{"$f":"IF($B26=\"\",\"\",Removals!$L23)","v":""},{"$f":"IF($B26=\"\",\"\",IFERROR(INDEX('quantities report'!$D$2:$D$10003,SMALL(IF('quantities report'!$A$2:$A$10003=AC$6,ROW('quantities report'!$A$2:$A$10003)-1,\"\"),ROWS($B$8:$B26))),\"0\"))","v":""},{"$f":"IF($B26=\"\",\"\",IFERROR(INDEX('quantities report'!$D$2:$D$10003,SMALL(IF('quantities report'!$A$2:$A$10003=AD$6,ROW('quantities report'!$A$2:$A$10003)-1,\"\"),ROWS($B$8:$B26))),\"0\"))","v":""},{"$f":"IF($B26=\"\",\"\",IFERROR(INDEX('quantities report'!$D$2:$D$10003,SMALL(IF('quantities report'!$A$2:$A$10003=AE$6,ROW('quantities report'!$A$2:$A$10003)-1,\"\"),ROWS($B$8:$B26))),\"0\"))","v":""},{"$f":"IF($B26=\"\",\"\",IFERROR(INDEX('quantities report'!$D$2:$D$10003,SMALL(IF('quantities report'!$A$2:$A$10003=AF$6,ROW('quantities report'!$A$2:$A$10003)-1,\"\"),ROWS($B$8:$B26))),\"0\"))","v":""},{"$f":"IF($B26=\"\",\"\",IFERROR(INDEX('quantities report'!$D$2:$D$10003,SMALL(IF('quantities report'!$A$2:$A$10003=AG$6,ROW('quantities report'!$A$2:$A$10003)-1,\"\"),ROWS($B$8:$B26))),\"0\"))","v":""},{"$f":"IF($B26=\"\",\"\",IFERROR(INDEX('quantities report'!$D$2:$D$10003,SMALL(IF('quantities report'!$A$2:$A$10003=AH$6,ROW('quantities report'!$A$2:$A$10003)-1,\"\"),ROWS($B$8:$B26))),\"0\"))","v":""},"","","","","",0.9,"",""]
[null,{"$f":"IFERROR(INDEX('manual inputs'!M:M,SMALL(IF('manual inputs'!M:M<>\"\",ROW('manual inputs'!M:M)),ROW(22:22))),\"\")","v":""},{"$f":"IF(B27=\"\",\"\",IFERROR(INDEX('quantities report'!$D$2:$D$10003,SMALL(IF('quantities report'!$A$2:$A$10003=C$6,ROW('quantities report'!$A$2:$A$10003)-1,\"\"),ROWS($B$8:$B27))),\"0\"))","v":""},"",null,"",{"$f":"IF($B27=\"\",\"\",Structure_Ex!I27)","v":""},null,{"$f":"IF($B27=\"\",\"\",IFERROR(INDEX('quantities report'!$D$2:$D$10003,SMALL(IF('quantities report'!$A$2:$A$10003=I$6,ROW('quantities report'!$A$2:$A$10003)-1,\"\"),ROWS($B$8:$B27))),\"0\"))","v":""},{"$f":"IF($B27=\"\",\"\",Removals!$F24)","v":""},{"$f":"IF($B27=\"\",\"\",Removals!$K24)","v":""},{"$f":"IF($B27=\"\",\"\",IFERROR(INDEX('quantities report'!$D$2:$D$10003,SMALL(IF('quantities report'!$A$2:$A$10003=L$6,ROW('quantities report'!$A$2:$A$10003)-1,\"\"),ROWS($B$8:$B27))),\"0\"))","v":""},{"$f":"IF(B27=\"\",\"\",LOOKUP(B27,'manual inputs'!$B$4:$B$22,'manual inputs'!$D$4:$D$22))","v":""},"",{"$f":"IF($B27=\"\",\"\",IFERROR(INDEX('quantities report'!$D$2:$D$10003,SMALL(IF('quantities report'!$A$2:$A$10003=O$6,ROW('quantities report'!$A$2:$A$10003)-1,\"\"),ROWS($B$8:$B27))),\"0\"))","v":""},"",null,"",{"$f":"IF($B27=\"\",\"\",IFERROR(INDEX('quantities report'!$D$2:$D$10003,SMALL(IF('quantities report'!$A$2:$A$10003=S$6,ROW('quantities report'!$A$2:$A$10003)-1,\"\"),ROWS($B$8:$B27))),\"0\"))","v":""},{"$f":"IF($B27=\"\",\"\",IFERROR(INDEX('quantities report'!$D$2:$D$10003,SMALL(IF('quantities report'!$A$2:$A$10003=T$6,ROW('quantities report'!$A$2:$A$10003)-1,\"\"),ROWS($B$8:$B27))),\"0\"))","v":""},{"$f":"IF($B27=\"\",\"\",IFERROR(INDEX('quantities report'!$D$2:$D$10003,SMALL(IF('quantities report'!$A$2:$A$10003=U$6,ROW('quantities report'!$A$2:$A$10003)-1,\"\"),ROWS($B$8:$B27))),\"0\"))","v":""},{"$f":"IF($B27=\"\",\"\",IFERROR(INDEX('quantities report'!$D$2:$D$10003,SMALL(IF('quantities report'!$A$2:$A$10003=V$6,ROW('quantities report'!$A$2:$A$10003)-1,\"\"),ROWS($B$8:$B27))),\"0\"))","v":""},{"$f":"IF($B27=\"\",\"\",IFERROR(INDEX('quantities report'!$D$2:$D$10003,SMALL(IF('quantities report'!$A$2:$A$10003=W$6,ROW('quantities report'!$A$2:$A$10003)-1,\"\"),ROWS($B$8:$B27))),\"0\"))","v":""},{"$f":"IF($B27=\"\",\"\",IFERROR(INDEX('quantities report'!$D$2:$D$10003,SMALL(IF('quantities report'!$A$2:$A$10003=X$6,ROW('quantities report'!$A$2:$A$10003)-1,\"\"),ROWS($B$8:$B27))),\"0\"))","v":""},{"$f":"IF($B27=\"\",\"\",IFERROR(INDEX('quantities report'!$D$2:$D$10003,SMALL(IF('quantities report'!$A$2:$A$10003=Y$6,ROW('quantities report'!$A$2:$A$10003)-1,\"\"),ROWS($B$8:$B27))),\"0\"))","v":""},{"$f":"IF($B27=\"\",\"\",IFERROR(INDEX('quantities report'!$D$2:$D$10003,SMALL(IF('quantities report'!$A$2:$A$10003=Z$6,ROW('quantities report'!$A$2:$A$10003)-1,\"\"),ROWS($B$8:$B27))),\"0\"))","v":""},{"$f":"IF($B27=\"\",\"\",Removals!$G24)","v":""},{"$f":"IF($B27=\"\",\"\",Removals!$L24)","v":""},{"$f":"IF($B27=\"\",\"\",IFERROR(INDEX('quantities report'!$D$2:$D$10003,SMALL(IF('quantities report'!$A$2:$A$10003=AC$6,ROW('quantities report'!$A$2:$A$10003)-1,\"\"),ROWS($B$8:$B27))),\"0\"))","v":""},{"$f":"IF($B27=\"\",\"\",IFERROR(INDEX('quantities report'!$D$2:$D$10003,SMALL(IF('quantities report'!$A$2:$A$10003=AD$6,ROW('quantities report'!$A$2:$A$10003)-1,\"\"),ROWS($B$8:$B27))),\"0\"))","v":""},{"$f":"IF($B27=\"\",\"\",IFERROR(INDEX('quantities report'!$D$2:$D$10003,SMALL(IF('quantities report'!$A$2:$A$10003=AE$6,ROW('quantities report'!$A$2:$A$10003)-1,\"\"),ROWS($B$8:$B27))),\"0\"))","v":""},{"$f":"IF($B27=\"\",\"\",IFERROR(INDEX('quantities report'!$D$2:$D$10003,SMALL(IF('quantities report'!$A$2:$A$10003=AF$6,ROW('quantities report'!$A$2:$A$10003)-1,\"\"),ROWS($B$8:$B27))),\"0\"))","v":""},{"$f":"IF($B27=\"\",\"\",IFERROR(INDEX('quantities report'!$D$2:$D$10003,SMALL(IF('quantities report'!$A$2:$A$10003=AG$6,ROW('quantities report'!$A$2:$A$10003)-1,\"\"),ROWS($B$8:$B27))),\"0\"))","v":""},{"$f":"IF($B27=\"\",\"\",IFERROR(INDEX('quantities report'!$D$2:$D$10003,SMALL(IF('quantities report'!$A$2:$A$10003=AH$6,ROW('quantities report'!$A$2:$A$10003)-1,\"\"),ROWS($B$8:$B27))),\"0\"))","v":""},"","","","","",0.9,"",""]
[null,{"$f":"IFERROR(INDEX('manual inputs'!M:M,SMALL(IF('manual inputs'!M:M<>\"\",ROW('manual inputs'!M:M)),ROW(23:23))),\"\")","v":""},{"$f":"IF(B28=\"\",\"\",IFERROR(INDEX('quantities report'!$D$2:$D$10003,SMALL(IF('quantities report'!$A$2:$A$10003=C$6,ROW('quantities report'!$A$2:$A$10003)-1,\"\"),ROWS($B$8:$B28))),\"0\"))","v":""},"",null,"",{"$f":"IF($B28=\"\",\"\",Structure_Ex!I28)","v":""},null,{"$f":"IF($B28=\"\",\"\",IFERROR(INDEX('quantities report'!$D$2:$D$10003,SMALL(IF('quantities report'!$A$2:$A$10003=I$6,ROW('quantities report'!$A$2:$A$10003)-1,\"\"),ROWS($B$8:$B28))),\"0\"))","v":""},{"$f":"IF($B28=\"\",\"\",Removals!$F25)","v":""},{"$f":"IF($B28=\"\",\"\",Removals!$K25)","v":""},{"$f":"IF($B28=\"\",\"\",IFERROR(INDEX('quantities report'!$D$2:$D$10003,SMALL(IF('quantities report'!$A$2:$A$10003=L$6,ROW('quantities report'!$A$2:$A$10003)-1,\"\"),ROWS($B$8:$B28))),\"0\"))","v":""},{"$f":"IF(B28=\"\",\"\",LOOKUP(B28,'manual inputs'!$B$4:$B$22,'manual inputs'!$D$4:$D$22))","v":""},"",{"$f":"IF($B28=\"\",\"\",IFERROR(INDEX('quantities report'!$D$2:$D$10003,SMALL(IF('quantities report'!$A$2:$A$10003=O$6,ROW('quantities report'!$A$2:$A$10003)-1,\"\"),ROWS($B$8:$B28))),\"0\"))","v":""},"",null,"",{"$f":"IF($B28=\"\",\"\",IFERROR(INDEX('quantities report'!$D$2:$D$10003,SMALL(IF('quantities report'!$A$2:$A$10003=S$6,ROW('quantities report'!$A$2:$A$10003)-1,\"\"),ROWS($B$8:$B28))),\"0\"))","v":""},{"$f":"IF($B28=\"\",\"\",IFERROR(INDEX('quantities report'!$D$2:$D$10003,SMALL(IF('quantities report'!$A$2:$A$10003=T$6,ROW('quantities report'!$A$2:$A$10003)-1,\"\"),ROWS($B$8:$B28))),\"0\"))","v":""},{"$f":"IF($B28=\"\",\"\",IFERROR(INDEX('quantities report'!$D$2:$D$10003,SMALL(IF('quantities report'!$A$2:$A$10003=U$6,ROW('quantities report'!$A$2:$A$10003)-1,\"\"),ROWS($B$8:$B28))),\"0\"))","v":""},{"$f":"IF($B28=\"\",\"\",IFERROR(INDEX('quantities report'!$D$2:$D$10003,SMALL(IF('quantities report'!$A$2:$A$10003=V$6,ROW('quantities report'!$A$2:$A$10003)-1,\"\"),ROWS($B$8:$B28))),\"0\"))","v":""},{"$f":"IF($B28=\"\",\"\",IFERROR(INDEX('quantities report'!$D$2:$D$10003,SMALL(IF('quantities report'!$A$2:$A$10003=W$6,ROW('quantities report'!$A$2:$A$10003)-1,\"\"),ROWS($B$8:$B28))),\"0\"))","v":""},{"$f":"IF($B28=\"\",\"\",IFERROR(INDEX('quantities report'!$D$2:$D$10003,SMALL(IF('quantities report'!$A$2:$A$10003=X$6,ROW('quantities report'!$A$2:$A$10003)-1,\"\"),ROWS($B$8:$B28))),\"0\"))","v":""},{"$f":"IF($B28=\"\",\"\",IFERROR(INDEX('quantities report'!$D$2:$D$10003,SMALL(IF('quantities report'!$A$2:$A$10003=Y$6,ROW('quantities report'!$A$2:$A$10003)-1,\"\"),ROWS($B$8:$B28))),\"0\"))","v":""},{"$f":"IF($B28=\"\",\"\",IFERROR(INDEX('quantities report'!$D$2:$D$10003,SMALL(IF('quantities report'!$A$2:$A$10003=Z$6,ROW('quantities report'!$A$2:$A$10003)-1,\"\"),ROWS($B$8:$B28))),\"0\"))","v":""},{"$f":"IF($B28=\"\",\"\",Removals!$G25)","v":""},{"$f":"IF($B28=\"\",\"\",Removals!$L25)","v":""},{"$f":"IF($B28=\"\",\"\",IFERROR(INDEX('quantities report'!$D$2:$D$10003,SMALL(IF('quantities report'!$A$2:$A$10003=AC$6,ROW('quantities report'!$A$2:$A$10003)-1,\"\"),ROWS($B$8:$B28))),\"0\"))","v":""},{"$f":"IF($B28=\"\",\"\",IFERROR(INDEX('quantities report'!$D$2:$D$10003,SMALL(IF('quantities report'!$A$2:$A$10003=AD$6,ROW('quantities report'!$A$2:$A$10003)-1,\"\"),ROWS($B$8:$B28))),\"0\"))","v":""},{"$f":"IF($B28=\"\",\"\",IFERROR(INDEX('quantities report'!$D$2:$D$10003,SMALL(IF('quantities report'!$A$2:$A$10003=AE$6,ROW('quantities report'!$A$2:$A$10003)-1,\"\"),ROWS($B$8:$B28))),\"0\"))","v":""},{"$f":"IF($B28=\"\",\"\",IFERROR(INDEX('quantities report'!$D$2:$D$10003,SMALL(IF('quantities report'!$A$2:$A$10003=AF$6,ROW('quantities report'!$A$2:$A$10003)-1,\"\"),ROWS($B$8:$B28))),\"0\"))","v":""},{"$f":"IF($B28=\"\",\"\",IFERROR(INDEX('quantities report'!$D$2:$D$10003,SMALL(IF('quantities report'!$A$2:$A$10003=AG$6,ROW('quantities report'!$A$2:$A$10003)-1,\"\"),ROWS($B$8:$B28))),\"0\"))","v":""},{"$f":"IF($B28=\"\",\"\",IFERROR(INDEX('quantities report'!$D$2:$D$10003,SMALL(IF('quantities report'!$A$2:$A$10003=AH$6,ROW('quantities report'!$A$2:$A$10003)-1,\"\"),ROWS($B$8:$B28))),\"0\"))","v":""},"","","","","",0.9,"",""]
[null,{"$f":"IFERROR(INDEX('manual inputs'!M:M,SMALL(IF('manual inputs'!M:M<>\"\",ROW('manual inputs'!M:M)),ROW(24:24))),\"\")","v":""},{"$f":"IF(B29=\"\",\"\",IFERROR(INDEX('quantities report'!$D$2:$D$10003,SMALL(IF('quantities report'!$A$2:$A$10003=C$6,ROW('quantities report'!$A$2:$A$10003)-1,\"\"),ROWS($B$8:$B29))),\"0\"))","v":""},"",null,"",{"$f":"IF($B29=\"\",\"\",Structure_Ex!I29)","v":""},null,{"$f":"IF($B29=\"\",\"\",IFERROR(INDEX('quantities report'!$D$2:$D$10003,SMALL(IF('quantities report'!$A$2:$A$10003=I$6,ROW('quantities report'!$A$2:$A$10003)-1,\"\"),ROWS($B$8:$B29))),\"0\"))","v":""},{"$f":"IF($B29=\"\",\"\",Removals!$F26)","v":""},{"$f":"IF($B29=\"\",\"\",Removals!$K26)","v":""},{"$f":"IF($B29=\"\",\"\",IFERROR(INDEX('quantities report'!$D$2:$D$10003,SMALL(IF('quantities report'!$A$2:$A$10003=L$6,ROW('quantities report'!$A$2:$A$10003)-1,\"\"),ROWS($B$8:$B29))),\"0\"))","v":""},{"$f":"IF(B29=\"\",\"\",LOOKUP(B29,'manual inputs'!$B$4:$B$22,'manual inputs'!$D$4:$D$22))","v":""},"",{"$f":"IF($B29=\"\",\"\",IFERROR(INDEX('quantities report'!$D$2:$D$10003,SMALL(IF('quantities report'!$A$2:$A$10003=O$6,ROW('quantities report'!$A$2:$A$10003)-1,\"\"),ROWS($B$8:$B29))),\"0\"))","v":""},"",null,"",{"$f":"IF($B29=\"\",\"\",IFERROR(INDEX('quantities report'!$D$2:$D$10003,SMALL(IF('quantities report'!$A$2:$A$10003=S$6,ROW('quantities report'!$A$2:$A$10003)-1,\"\"),ROWS($B$8:$B29))),\"0\"))","v":""},{"$f":"IF($B29=\"\",\"\",IFERROR(INDEX('quantities report'!$D$2:$D$10003,SMALL(IF('quantities report'!$A$2:$A$10003=T$6,ROW('quantities report'!$A$2:$A$10003)-1,\"\"),ROWS($B$8:$B29))),\"0\"))","v":""},{"$f":"IF($B29=\"\",\"\",IFERROR(INDEX('quantities report'!$D$2:$D$10003,SMALL(IF('quantities report'!$A$2:$A$10003=U$6,ROW('quantities report'!$A$2:$A$10003)-1,\"\"),ROWS($B$8:$B29))),\"0\"))","v":""},{"$f":"IF($B29=\"\",\"\",IFERROR(INDEX('quantities report'!$D$2:$D$10003,SMALL(IF('quantities report'!$A$2:$A$10003=V$6,ROW('quantities report'!$A$2:$A$10003)-1,\"\"),ROWS($B$8:$B29))),\"0\"))","v":""},{"$f":"IF($B29=\"\",\"\",IFERROR(INDEX('quantities report'!$D$2:$D$10003,SMALL(IF('quantities report'!$A$2:$A$10003=W$6,ROW('quantities report'!$A$2:$A$10003)-1,\"\"),ROWS($B$8:$B29))),\"0\"))","v":""},{"$f":"IF($B29=\"\",\"\",IFERROR(INDEX('quantities report'!$D$2:$D$10003,SMALL(IF('quantities report'!$A$2:$A$10003=X$6,ROW('quantities report'!$A$2:$A$10003)-1,\"\"),ROWS($B$8:$B29))),\"0\"))","v":""},{"$f":"IF($B29=\"\",\"\",IFERROR(INDEX('quantities report'!$D$2:$D$10003,SMALL(IF('quantities report'!$A$2:$A$10003=Y$6,ROW('quantities report'!$A$2:$A$10003)-1,\"\"),ROWS($B$8:$B29))),\"0\"))","v":""},{"$f":"IF($B29=\"\",\"\",IFERROR(INDEX('quantities report'!$D$2:$D$10003,SMALL(IF('quantities report'!$A$2:$A$10003=Z$6,ROW('quantities report'!$A$2:$A$10003)-1,\"\"),ROWS($B$8:$B29))),\"0\"))","v":""},{"$f":"IF($B29=\"\",\"\",Removals!$G26)","v":""},{"$f":"IF($B29=\"\",\"\",Removals!$L26)","v":""},{"$f":"IF($B29=\"\",\"\",IFERROR(INDEX('quantities report'!$D$2:$D$10003,SMALL(IF('quantities report'!$A$2:$A$10003=AC$6,ROW('quantities report'!$A$2:$A$10003)-1,\"\"),ROWS($B$8:$B29))),\"0\"))","v":""},{"$f":"IF($B29=\"\",\"\",IFERROR(INDEX('quantities report'!$D$2:$D$10003,SMALL(IF('quantities report'!$A$2:$A$10003=AD$6,ROW('quantities report'!$A$2:$A$10003)-1,\"\"),ROWS($B$8:$B29))),\"0\"))","v":""},{"$f":"IF($B29=\"\",\"\",IFERROR(INDEX('quantities report'!$D$2:$D$10003,SMALL(IF('quantities report'!$A$2:$A$10003=AE$6,ROW('quantities report'!$A$2:$A$10003)-1,\"\"),ROWS($B$8:$B29))),\"0\"))","v":""},{"$f":"IF($B29=\"\",\"\",IFERROR(INDEX('quantities report'!$D$2:$D$10003,SMALL(IF('quantities report'!$A$2:$A$10003=AF$6,ROW('quantities report'!$A$2:$A$10003)-1,\"\"),ROWS($B$8:$B29))),\"0\"))","v":""},{"$f":"IF($B29=\"\",\"\",IFERROR(INDEX('quantities report'!$D$2:$D$10003,SMALL(IF('quantities report'!$A$2:$A$10003=AG$6,ROW('quantities report'!$A$2:$A$10003)-1,\"\"),ROWS($B$8:$B29))),\"0\"))","v":""},{"$f":"IF($B29=\"\",\"\",IFERROR(INDEX('quantities report'!$D$2:$D$10003,SMALL(IF('quantities report'!$A$2:$A$10003=AH$6,ROW('quantities report'!$A$2:$A$10003)-1,\"\"),ROWS($B$8:$B29))),\"0\"))","v":""},"","","","","",0.9,"",""]
[null,{"$f":"IFERROR(INDEX('manual inputs'!M:M,SMALL(IF('manual inputs'!M:M<>\"\",ROW('manual inputs'!M:M)),ROW(25:25))),\"\")","v":""},{"$f":"IF(B30=\"\",\"\",IFERROR(INDEX('quantities report'!$D$2:$D$10003,SMALL(IF('quantities report'!$A$2:$A$10003=C$6,ROW('quantities report'!$A$2:$A$10003)-1,\"\"),ROWS($B$8:$B30))),\"0\"))","v":""},"",null,"",{"$f":"IF($B30=\"\",\"\",Structure_Ex!I30)","v":""},null,{"$f":"IF($B30=\"\",\"\",IFERROR(INDEX('quantities report'!$D$2:$D$10003,SMALL(IF('quantities report'!$A$2:$A$10003=I$6,ROW('quantities report'!$A$2:$A$10003)-1,\"\"),ROWS($B$8:$B30))),\"0\"))","v":""},{"$f":"IF($B30=\"\",\"\",Removals!$F27)","v":""},{"$f":"IF($B30=\"\",\"\",Removals!$K27)","v":""},{"$f":"IF($B30=\"\",\"\",IFERROR(INDEX('quantities report'!$D$2:$D$10003,SMALL(IF('quantities report'!$A$2:$A$10003=L$6,ROW('quantities report'!$A$2:$A$10003)-1,\"\"),ROWS($B$8:$B30))),\"0\"))","v":""},{"$f":"IF(B30=\"\",\"\",LOOKUP(B30,'manual inputs'!$B$4:$B$22,'manual inputs'!$D$4:$D$22))","v":""},"",{"$f":"IF($B30=\"\",\"\",IFERROR(INDEX('quantities report'!$D$2:$D$10003,SMALL(IF('quantities report'!$A$2:$A$10003=O$6,ROW('quantities report'!$A$2:$A$10003)-1,\"\"),ROWS($B$8:$B30))),\"0\"))","v":""},"",null,"",{"$f":"IF($B30=\"\",\"\",IFERROR(INDEX('quantities report'!$D$2:$D$10003,SMALL(IF('quantities report'!$A$2:$A$10003=S$6,ROW('quantities report'!$A$2:$A$10003)-1,\"\"),ROWS($B$8:$B30))),\"0\"))","v":""},{"$f":"IF($B30=\"\",\"\",IFERROR(INDEX('quantities report'!$D$2:$D$10003,SMALL(IF('quantities report'!$A$2:$A$10003=T$6,ROW('quantities report'!$A$2:$A$10003)-1,\"\"),ROWS($B$8:$B30))),\"0\"))","v":""},{"$f":"IF($B30=\"\",\"\",IFERROR(INDEX('quantities report'!$D$2:$D$10003,SMALL(IF('quantities report'!$A$2:$A$10003=U$6,ROW('quantities report'!$A$2:$A$10003)-1,\"\"),ROWS($B$8:$B30))),\"0\"))","v":""},{"$f":"IF($B30=\"\",\"\",IFERROR(INDEX('quantities report'!$D$2:$D$10003,SMALL(IF('quantities report'!$A$2:$A$10003=V$6,ROW('quantities report'!$A$2:$A$10003)-1,\"\"),ROWS($B$8:$B30))),\"0\"))","v":""},{"$f":"IF($B30=\"\",\"\",IFERROR(INDEX('quantities report'!$D$2:$D$10003,SMALL(IF('quantities report'!$A$2:$A$10003=W$6,ROW('quantities report'!$A$2:$A$10003)-1,\"\"),ROWS($B$8:$B30))),\"0\"))","v":""},{"$f":"IF($B30=\"\",\"\",IFERROR(INDEX('quantities report'!$D$2:$D$10003,SMALL(IF('quantities report'!$A$2:$A$10003=X$6,ROW('quantities report'!$A$2:$A$10003)-1,\"\"),ROWS($B$8:$B30))),\"0\"))","v":""},{"$f":"IF($B30=\"\",\"\",IFERROR(INDEX('quantities report'!$D$2:$D$10003,SMALL(IF('quantities report'!$A$2:$A$10003=Y$6,ROW('quantities report'!$A$2:$A$10003)-1,\"\"),ROWS($B$8:$B30))),\"0\"))","v":""},{"$f":"IF($B30=\"\",\"\",IFERROR(INDEX('quantities report'!$D$2:$D$10003,SMALL(IF('quantities report'!$A$2:$A$10003=Z$6,ROW('quantities report'!$A$2:$A$10003)-1,\"\"),ROWS($B$8:$B30))),\"0\"))","v":""},{"$f":"IF($B30=\"\",\"\",Removals!$G27)","v":""},{"$f":"IF($B30=\"\",\"\",Removals!$L27)","v":""},{"$f":"IF($B30=\"\",\"\",IFERROR(INDEX('quantities report'!$D$2:$D$10003,SMALL(IF('quantities report'!$A$2:$A$10003=AC$6,ROW('quantities report'!$A$2:$A$10003)-1,\"\"),ROWS($B$8:$B30))),\"0\"))","v":""},{"$f":"IF($B30=\"\",\"\",IFERROR(INDEX('quantities report'!$D$2:$D$10003,SMALL(IF('quantities report'!$A$2:$A$10003=AD$6,ROW('quantities report'!$A$2:$A$10003)-1,\"\"),ROWS($B$8:$B30))),\"0\"))","v":""},{"$f":"IF($B30=\"\",\"\",IFERROR(INDEX('quantities report'!$D$2:$D$10003,SMALL(IF('quantities report'!$A$2:$A$10003=AE$6,ROW('quantities report'!$A$2:$A$10003)-1,\"\"),ROWS($B$8:$B30))),\"0\"))","v":""},{"$f":"IF($B30=\"\",\"\",IFERROR(INDEX('quantities report'!$D$2:$D$10003,SMALL(IF('quantities report'!$A$2:$A$10003=AF$6,ROW('quantities report'!$A$2:$A$10003)-1,\"\"),ROWS($B$8:$B30))),\"0\"))","v":""},{"$f":"IF($B30=\"\",\"\",IFERROR(INDEX('quantities report'!$D$2:$D$10003,SMALL(IF('quantities report'!$A$2:$A$10003=AG$6,ROW('quantities report'!$A$2:$A$10003)-1,\"\"),ROWS($B$8:$B30))),\"0\"))","v":""},{"$f":"IF($B30=\"\",\"\",IFERROR(INDEX('quantities report'!$D$2:$D$10003,SMALL(IF('quantities report'!$A$2:$A$10003=AH$6,ROW('quantities report'!$A$2:$A$10003)-1,\"\"),ROWS($B$8:$B30))),\"0\"))","v":""},"","","","","",0.9,"",""]
[null,{"$f":"IFERROR(INDEX('manual inputs'!M:M,SMALL(IF('manual inputs'!M:M<>\"\",ROW('manual inputs'!M:M)),ROW(27:27))),\"\")","v":""},{"$f":"IF(B31=\"\",\"\",IFERROR(INDEX('quantities report'!$D$2:$D$10003,SMALL(IF('quantities report'!$A$2:$A$10003=C$6,ROW('quantities report'!$A$2:$A$10003)-1,\"\"),ROWS($B$8:$B31))),\"0\"))","v":""},"",null,"",{"$f":"IF($B31=\"\",\"\",Structure_Ex!I31)","v":""},null,{"$f":"IF($B31=\"\",\"\",IFERROR(INDEX('quantities report'!$D$2:$D$10003,SMALL(IF('quantities report'!$A$2:$A$10003=I$6,ROW('quantities report'!$A$2:$A$10003)-1,\"\"),ROWS($B$8:$B31))),\"0\"))","v":""},{"$f":"IF($B31=\"\",\"\",Removals!$F28)","v":""},{"$f":"IF($B31=\"\",\"\",Removals!$K28)","v":""},{"$f":"IF($B31=\"\",\"\",IFERROR(INDEX('quantities report'!$D$2:$D$10003,SMALL(IF('quantities report'!$A$2:$A$10003=L$6,ROW('quantities report'!$A$2:$A$10003)-1,\"\"),ROWS($B$8:$B31))),\"0\"))","v":""},{"$f":"IF(B31=\"\",\"\",LOOKUP(B31,'manual inputs'!$B$4:$B$22,'manual inputs'!$D$4:$D$22))","v":""},"",{"$f":"IF($B31=\"\",\"\",IFERROR(INDEX('quantities report'!$D$2:$D$10003,SMALL(IF('quantities report'!$A$2:$A$10003=O$6,ROW('quantities report'!$A$2:$A$10003)-1,\"\"),ROWS($B$8:$B31))),\"0\"))","v":""},"",null,"",{"$f":"IF($B31=\"\",\"\",IFERROR(INDEX('quantities report'!$D$2:$D$10003,SMALL(IF('quantities report'!$A$2:$A$10003=S$6,ROW('quantities report'!$A$2:$A$10003)-1,\"\"),ROWS($B$8:$B31))),\"0\"))","v":""},{"$f":"IF($B31=\"\",\"\",IFERROR(INDEX('quantities report'!$D$2:$D$10003,SMALL(IF('quantities report'!$A$2:$A$10003=T$6,ROW('quantities report'!$A$2:$A$10003)-1,\"\"),ROWS($B$8:$B31))),\"0\"))","v":""},{"$f":"IF($B31=\"\",\"\",IFERROR(INDEX('quantities report'!$D$2:$D$10003,SMALL(IF('quantities report'!$A$2:$A$10003=U$6,ROW('quantities report'!$A$2:$A$10003)-1,\"\"),ROWS($B$8:$B31))),\"0\"))","v":""},{"$f":"IF($B31=\"\",\"\",IFERROR(INDEX('quantities report'!$D$2:$D$10003,SMALL(IF('quantities report'!$A$2:$A$10003=V$6,ROW('quantities report'!$A$2:$A$10003)-1,\"\"),ROWS($B$8:$B31))),\"0\"))","v":""},{"$f":"IF($B31=\"\",\"\",IFERROR(INDEX('quantities report'!$D$2:$D$10003,SMALL(IF('quantities report'!$A$2:$A$10003=W$6,ROW('quantities report'!$A$2:$A$10003)-1,\"\"),ROWS($B$8:$B31))),\"0\"))","v":""},{"$f":"IF($B31=\"\",\"\",IFERROR(INDEX('quantities report'!$D$2:$D$10003,SMALL(IF('quantities report'!$A$2:$A$10003=X$6,ROW('quantities report'!$A$2:$A$10003)-1,\"\"),ROWS($B$8:$B31))),\"0\"))","v":""},{"$f":"IF($B31=\"\",\"\",IFERROR(INDEX('quantities report'!$D$2:$D$10003,SMALL(IF('quantities report'!$A$2:$A$10003=Y$6,ROW('quantities report'!$A$2:$A$10003)-1,\"\"),ROWS($B$8:$B31))),\"0\"))","v":""},{"$f":"IF($B31=\"\",\"\",IFERROR(INDEX('quantities report'!$D$2:$D$10003,SMALL(IF('quantities report'!$A$2:$A$10003=Z$6,ROW('quantities report'!$A$2:$A$10003)-1,\"\"),ROWS($B$8:$B31))),\"0\"))","v":""},{"$f":"IF($B31=\"\",\"\",Removals!$G28)","v":""},{"$f":"IF($B31=\"\",\"\",Removals!$L28)","v":""},{"$f":"IF($B31=\"\",\"\",IFERROR(INDEX('quantities report'!$D$2:$D$10003,SMALL(IF('quantities report'!$A$2:$A$10003=AC$6,ROW('quantities report'!$A$2:$A$10003)-1,\"\"),ROWS($B$8:$B31))),\"0\"))","v":""},{"$f":"IF($B31=\"\",\"\",IFERROR(INDEX('quantities report'!$D$2:$D$10003,SMALL(IF('quantities report'!$A$2:$A$10003=AD$6,ROW('quantities report'!$A$2:$A$10003)-1,\"\"),ROWS($B$8:$B31))),\"0\"))","v":""},{"$f":"IF($B31=\"\",\"\",IFERROR(INDEX('quantities report'!$D$2:$D$10003,SMALL(IF('quantities report'!$A$2:$A$10003=AE$6,ROW('quantities report'!$A$2:$A$10003)-1,\"\"),ROWS($B$8:$B31))),\"0\"))","v":""},{"$f":"IF($B31=\"\",\"\",IFERROR(INDEX('quantities report'!$D$2:$D$10003,SMALL(IF('quantities report'!$A$2:$A$10003=AF$6,ROW('quantities report'!$A$2:$A$10003)-1,\"\"),ROWS($B$8:$B31))),\"0\"))","v":""},{"$f":"IF($B31=\"\",\"\",IFERROR(INDEX('quantities report'!$D$2:$D$10003,SMALL(IF('quantities report'!$A$2:$A$10003=AG$6,ROW('quantities report'!$A$2:$A$10003)-1,\"\"),ROWS($B$8:$B31))),\"0\"))","v":""},{"$f":"IF($B31=\"\",\"\",IFERROR(INDEX('quantities report'!$D$2:$D$10003,SMALL(IF('quantities report'!$A$2:$A$10003=AH$6,ROW('quantities report'!$A$2:$A$10003)-1,\"\"),ROWS($B$8:$B31))),\"0\"))","v":""},"","","","","",0.9,"",""]
[null,{"$f":"IFERROR(INDEX(#REF!,SMALL(IF(#REF!<>\"\",ROW(#REF!)),ROW(27:27))),\"\")","v":""}]

{"sheet":"Removals","index":5,"n_rows":28,"n_cols":12,"rows_kept":28,"cut":false,"hidden":false,"merged":[]}
[]
[null,"TOTALS",{"$f":"SUM(C5:C28)","v":0},0,0,0,0,{"$f":"SUM(H5:H28)","v":0},{"$f":"SUM(I5:I28)","v":0},0,{"$f":"SUM(K5:K28)","v":0},0]
[null,"Station","Pavement Removed","Pavement Removed/Replaced","Total",null,null,"Topsoil Removed","Topsoil Removed/Replaced","Total"]
[null,null,"CFL Exist Pvmt (removed): ","CFL Exist Pvmt (removed and replaced): ","Total CFL Exist Pvmt: ","Pavement Removed","Pavement Removed/Replaced","CFL Exist Topsoil (removed): ","CFL Exist Topsoil (removed and replaced): ","Total CFL Exist Topsoil: ","Topsoil Removed","Topsoil Removed/Replaced"]
[null,{"$f":"IFERROR(INDEX('manual inputs'!M:M,SMALL(IF('manual inputs'!M:M<>\"\",ROW('manual inputs'!M:M)),ROW(3:3))),\"\")","v":""},{"$f":"IF($B5=\"\",\"\",VALUE(IFERROR(INDEX('quantities report'!$D$2:$D$10003,SMALL(IF('quantities report'!$A$2:$A$10003=C$4,ROW('quantities report'!$A$2:$A$10003)-1,\"\"),ROWS($B$9:$B9))),\"0\")))","v":""},{"$f":"IF($B5=\"\",\"\",VALUE(IFERROR(INDEX('quantities report'!$D$2:$D$10003,SMALL(IF('quantities report'!$A$2:$A$10003=D$4,ROW('quantities report'!$A$2:$A$10003)-1,\"\"),ROWS($B$9:$B9))),\"0\")))","v":""},{"$f":"IF($B5=\"\",\"\",VALUE(IFERROR(INDEX('quantities report'!$D$2:$D$10003,SMALL(IF('quantities report'!$A$2:$A$10003=E$4,ROW('quantities report'!$A$2:$A$10003)-1,\"\"),ROWS($B$9:$B9))),\"0\")))","v":""},{"$f":"IF(C5=0,(E5-D5),C5)","v":""},{"$f":"IF(D5=0,(E5-C5),D5)","v":""},{"$f":"IF($B5=\"\",\"\",IFERROR(INDEX('quantities report'!$D$2:$D$10003,SMALL(IF('quantities report'!$A$2:$A$10003=H$4,ROW('quantities report'!$A$2:$A$10003)-1,\"\"),ROWS($B$9:$B9))),\"0\"))","v":""},{"$f":"IF($B5=\"\",\"\",VALUE(IFERROR(INDEX('quantities report'!$D$2:$D$10003,SMALL(IF('quantities report'!$A$2:$A$10003=I$4,ROW('quantities report'!$A$2:$A$10003)-1,\"\"),ROWS($B$9:$B9))),\"0\")))","v":""},{"$f":"IF($B5=\"\",\"\",VALUE(IFERROR(INDEX('quantities report'!$D$2:$D$10003,SMALL(IF('quantities report'!$A$2:$A$10003=J$4,ROW('quantities report'!$A$2:$A$10003)-1,\"\"),ROWS($B$9:$B9))),\"0\")))","v":""},{"$f":"IF(H5=0,(J5-I5),H5)","v":""},{"$f":"IF(I5=0,(J5-H5),I5)","v":""}]
[null,{"$f":"IFERROR(INDEX('manual inputs'!M:M,SMALL(IF('manual inputs'!M:M<>\"\",ROW('manual inputs'!M:M)),ROW(4:4))),\"\")","v":""},{"$f":"IF($B6=\"\",\"\",VALUE(IFERROR(INDEX('quantities report'!$D$2:$D$10003,SMALL(IF('quantities report'!$A$2:$A$10003=C$4,ROW('quantities report'!$A$2:$A$10003)-1,\"\"),ROWS($B$9:$B10))),\"0\")))","v":""},{"$f":"IF($B6=\"\",\"\",VALUE(IFERROR(INDEX('quantities report'!$D$2:$D$10003,SMALL(IF('quantities report'!$A$2:$A$10003=D$4,ROW('quantities report'!$A$2:$A$10003)-1,\"\"),ROWS($B$9:$B10))),\"0\")))","v":""},{"$f":"IF($B6=\"\",\"\",VALUE(IFERROR(INDEX('quantities report'!$D$2:$D$10003,SMALL(IF('quantities report'!$A$2:$A$10003=E$4,ROW('quantities report'!$A$2:$A$10003)-1,\"\"),ROWS($B$9:$B10))),\"0\")))","v":""},{"$f":"IF(C6=0,(E6-D6),C6)","v":""},{"$f":"IF(D6=0,(E6-C6),D6)","v":""},{"$f":"IF($B6=\"\",\"\",IFERROR(INDEX('quantities report'!$D$2:$D$10003,SMALL(IF('quantities report'!$A$2:$A$10003=H$4,ROW('quantities report'!$A$2:$A$10003)-1,\"\"),ROWS($B$9:$B10))),\"0\"))","v":""},{"$f":"IF($B6=\"\",\"\",VALUE(IFERROR(INDEX('quantities report'!$D$2:$D$10003,SMALL(IF('quantities report'!$A$2:$A$10003=I$4,ROW('quantities report'!$A$2:$A$10003)-1,\"\"),ROWS($B$9:$B10))),\"0\")))","v":""},{"$f":"IF($B6=\"\",\"\",VALUE(IFERROR(INDEX('quantities report'!$D$2:$D$10003,SMALL(IF('quantities report'!$A$2:$A$10003=J$4,ROW('quantities report'!$A$2:$A$10003)-1,\"\"),ROWS($B$9:$B10))),\"0\")))","v":""},{"$f":"IF(H6=0,(J6-I6),H6)","v":""},{"$f":"IF(I6=0,(J6-H6),I6)","v":""}]
[null,{"$f":"IFERROR(INDEX('manual inputs'!M:M,SMALL(IF('manual inputs'!M:M<>\"\",ROW('manual inputs'!M:M)),ROW(5:5))),\"\")","v":""},{"$f":"IF($B7=\"\",\"\",VALUE(IFERROR(INDEX('quantities report'!$D$2:$D$10003,SMALL(IF('quantities report'!$A$2:$A$10003=C$4,ROW('quantities report'!$A$2:$A$10003)-1,\"\"),ROWS($B$9:$B11))),\"0\")))","v":""},{"$f":"IF($B7=\"\",\"\",VALUE(IFERROR(INDEX('quantities report'!$D$2:$D$10003,SMALL(IF('quantities report'!$A$2:$A$10003=D$4,ROW('quantities report'!$A$2:$A$10003)-1,\"\"),ROWS($B$9:$B11))),\"0\")))","v":""},{"$f":"IF($B7=\"\",\"\",VALUE(IFERROR(INDEX('quantities report'!$D$2:$D$10003,SMALL(IF('quantities report'!$A$2:$A$10003=E$4,ROW('quantities report'!$A$2:$A$10003)-1,\"\"),ROWS($B$9:$B11))),\"0\")))","v":""},"","",{"$f":"IF($B7=\"\",\"\",IFERROR(INDEX('quantities report'!$D$2:$D$10003,SMALL(IF('quantities report'!$A$2:$A$10003=H$4,ROW('quantities report'!$A$2:$A$10003)-1,\"\"),ROWS($B$9:$B11))),\"0\"))","v":""},{"$f":"IF($B7=\"\",\"\",VALUE(IFERROR(INDEX('quantities report'!$D$2:$D$10003,SMALL(IF('quantities report'!$A$2:$A$10003=I$4,ROW('quantities report'!$A$2:$A$10003)-1,\"\"),ROWS($B$9:$B11))),\"0\")))","v":""},{"$f":"IF($B7=\"\",\"\",VALUE(IFERROR(INDEX('quantities report'!$D$2:$D$10003,SMALL(IF('quantities report'!$A$2:$A$10003=J$4,ROW('quantities report'!$A$2:$A$10003)-1,\"\"),ROWS($B$9:$B11))),\"0\")))","v":""},"",""]
[null,{"$f":"IFERROR(INDEX('manual inputs'!M:M,SMALL(IF('manual inputs'!M:M<>\"\",ROW('manual inputs'!M:M)),ROW(6:6))),\"\")","v":""},{"$f":"IF($B8=\"\",\"\",VALUE(IFERROR(INDEX('quantities report'!$D$2:$D$10003,SMALL(IF('quantities report'!$A$2:$A$10003=C$4,ROW('quantities report'!$A$2:$A$10003)-1,\"\"),ROWS($B$9:$B12))),\"0\")))","v":""},{"$f":"IF($B8=\"\",\"\",VALUE(IFERROR(INDEX('quantities report'!$D$2:$D$10003,SMALL(IF('quantities report'!$A$2:$A$10003=D$4,ROW('quantities report'!$A$2:$A$10003)-1,\"\"),ROWS($B$9:$B12))),\"0\")))","v":""},{"$f":"IF($B8=\"\",\"\",VALUE(IFERROR(INDEX('quantities report'!$D$2:$D$10003,SMALL(IF('quantities report'!$A$2:$A$10003=E$4,ROW('quantities report'!$A$2:$A$10003)-1,\"\"),ROWS($B$9:$B12))),\"0\")))","v":""},"","",{"$f":"IF($B8=\"\",\"\",IFERROR(INDEX('quantities report'!$D$2:$D$10003,SMALL(IF('quantities report'!$A$2:$A$10003=H$4,ROW('quantities report'!$A$2:$A$10003)-1,\"\"),ROWS($B$9:$B12))),\"0\"))","v":""},{"$f":"IF($B8=\"\",\"\",VALUE(IFERROR(INDEX('quantities report'!$D$2:$D$10003,SMALL(IF('quantities report'!$A$2:$A$10003=I$4,ROW('quantities report'!$A$2:$A$10003)-1,\"\"),ROWS($B$9:$B12))),\"0\")))","v":""},{"$f":"IF($B8=\"\",\"\",VALUE(IFERROR(INDEX('quantities report'!$D$2:$D$10003,SMALL(IF('quantities report'!$A$2:$A$10003=J$4,ROW('quantities report'!$A$2:$A$10003)-1,\"\"),ROWS($B$9:$B12))),\"0\")))","v":""},"",""]
[null,{"$f":"IFERROR(INDEX('manual inputs'!M:M,SMALL(IF('manual inputs'!M:M<>\"\",ROW('manual inputs'!M:M)),ROW(7:7))),\"\")","v":""},{"$f":"IF($B9=\"\",\"\",VALUE(IFERROR(INDEX('quantities report'!$D$2:$D$10003,SMALL(IF('quantities report'!$A$2:$A$10003=C$4,ROW('quantities report'!$A$2:$A$10003)-1,\"\"),ROWS($B$9:$B13))),\"0\")))","v":""},{"$f":"IF($B9=\"\",\"\",VALUE(IFERROR(INDEX('quantities report'!$D$2:$D$10003,SMALL(IF('quantities report'!$A$2:$A$10003=D$4,ROW('quantities report'!$A$2:$A$10003)-1,\"\"),ROWS($B$9:$B13))),\"0\")))","v":""},{"$f":"IF($B9=\"\",\"\",VALUE(IFERROR(INDEX('quantities report'!$D$2:$D$10003,SMALL(IF('quantities report'!$A$2:$A$10003=E$4,ROW('quantities report'!$A$2:$A$10003)-1,\"\"),ROWS($B$9:$B13))),\"0\")))","v":""},"","",{"$f":"IF($B9=\"\",\"\",IFERROR(INDEX('quantities report'!$D$2:$D$10003,SMALL(IF('quantities report'!$A$2:$A$10003=H$4,ROW('quantities report'!$A$2:$A$10003)-1,\"\"),ROWS($B$9:$B13))),\"0\"))","v":""},{"$f":"IF($B9=\"\",\"\",VALUE(IFERROR(INDEX('quantities report'!$D$2:$D$10003,SMALL(IF('quantities report'!$A$2:$A$10003=I$4,ROW('quantities report'!$A$2:$A$10003)-1,\"\"),ROWS($B$9:$B13))),\"0\")))","v":""},{"$f":"IF($B9=\"\",\"\",VALUE(IFERROR(INDEX('quantities report'!$D$2:$D$10003,SMALL(IF('quantities report'!$A$2:$A$10003=J$4,ROW('quantities report'!$A$2:$A$10003)-1,\"\"),ROWS($B$9:$B13))),\"0\")))","v":""},"",""]
[null,{"$f":"IFERROR(INDEX('manual inputs'!M:M,SMALL(IF('manual inputs'!M:M<>\"\",ROW('manual inputs'!M:M)),ROW(8:8))),\"\")","v":""},{"$f":"IF($B10=\"\",\"\",VALUE(IFERROR(INDEX('quantities report'!$D$2:$D$10003,SMALL(IF('quantities report'!$A$2:$A$10003=C$4,ROW('quantities report'!$A$2:$A$10003)-1,\"\"),ROWS($B$9:$B14))),\"0\")))","v":""},{"$f":"IF($B10=\"\",\"\",VALUE(IFERROR(INDEX('quantities report'!$D$2:$D$10003,SMALL(IF('quantities report'!$A$2:$A$10003=D$4,ROW('quantities report'!$A$2:$A$10003)-1,\"\"),ROWS($B$9:$B14))),\"0\")))","v":""},{"$f":"IF($B10=\"\",\"\",VALUE(IFERROR(INDEX('quantities report'!$D$2:$D$10003,SMALL(IF('quantities report'!$A$2:$A$10003=E$4,ROW('quantities report'!$A$2:$A$10003)-1,\"\"),ROWS($B$9:$B14))),\"0\")))","v":""},"","",{"$f":"IF($B10=\"\",\"\",IFERROR(INDEX('quantities report'!$D$2:$D$10003,SMALL(IF('quantities report'!$A$2:$A$10003=H$4,ROW('quantities report'!$A$2:$A$10003)-1,\"\"),ROWS($B$9:$B14))),\"0\"))","v":""},{"$f":"IF($B10=\"\",\"\",VALUE(IFERROR(INDEX('quantities report'!$D$2:$D$10003,SMALL(IF('quantities report'!$A$2:$A$10003=I$4,ROW('quantities report'!$A$2:$A$10003)-1,\"\"),ROWS($B$9:$B14))),\"0\")))","v":""},{"$f":"IF($B10=\"\",\"\",VALUE(IFERROR(INDEX('quantities report'!$D$2:$D$10003,SMALL(IF('quantities report'!$A$2:$A$10003=J$4,ROW('quantities report'!$A$2:$A$10003)-1,\"\"),ROWS($B$9:$B14))),\"0\")))","v":""},"",""]
[null,{"$f":"IFERROR(INDEX('manual inputs'!M:M,SMALL(IF('manual inputs'!M:M<>\"\",ROW('manual inputs'!M:M)),ROW(9:9))),\"\")","v":""},{"$f":"IF($B11=\"\",\"\",VALUE(IFERROR(INDEX('quantities report'!$D$2:$D$10003,SMALL(IF('quantities report'!$A$2:$A$10003=C$4,ROW('quantities report'!$A$2:$A$10003)-1,\"\"),ROWS($B$9:$B15))),\"0\")))","v":""},{"$f":"IF($B11=\"\",\"\",VALUE(IFERROR(INDEX('quantities report'!$D$2:$D$10003,SMALL(IF('quantities report'!$A$2:$A$10003=D$4,ROW('quantities report'!$A$2:$A$10003)-1,\"\"),ROWS($B$9:$B15))),\"0\")))","v":""},{"$f":"IF($B11=\"\",\"\",VALUE(IFERROR(INDEX('quantities report'!$D$2:$D$10003,SMALL(IF('quantities report'!$A$2:$A$10003=E$4,ROW('quantities report'!$A$2:$A$10003)-1,\"\"),ROWS($B$9:$B15))),\"0\")))","v":""},"","",{"$f":"IF($B11=\"\",\"\",IFERROR(INDEX('quantities report'!$D$2:$D$10003,SMALL(IF('quantities report'!$A$2:$A$10003=H$4,ROW('quantities report'!$A$2:$A$10003)-1,\"\"),ROWS($B$9:$B15))),\"0\"))","v":""},{"$f":"IF($B11=\"\",\"\",VALUE(IFERROR(INDEX('quantities report'!$D$2:$D$10003,SMALL(IF('quantities report'!$A$2:$A$10003=I$4,ROW('quantities report'!$A$2:$A$10003)-1,\"\"),ROWS($B$9:$B15))),\"0\")))","v":""},{"$f":"IF($B11=\"\",\"\",VALUE(IFERROR(INDEX('quantities report'!$D$2:$D$10003,SMALL(IF('quantities report'!$A$2:$A$10003=J$4,ROW('quantities report'!$A$2:$A$10003)-1,\"\"),ROWS($B$9:$B15))),\"0\")))","v":""},"",""]
[null,{"$f":"IFERROR(INDEX('manual inputs'!M:M,SMALL(IF('manual inputs'!M:M<>\"\",ROW('manual inputs'!M:M)),ROW(10:10))),\"\")","v":""},{"$f":"IF($B12=\"\",\"\",VALUE(IFERROR(INDEX('quantities report'!$D$2:$D$10003,SMALL(IF('quantities report'!$A$2:$A$10003=C$4,ROW('quantities report'!$A$2:$A$10003)-1,\"\"),ROWS($B$9:$B16))),\"0\")))","v":""},{"$f":"IF($B12=\"\",\"\",VALUE(IFERROR(INDEX('quantities report'!$D$2:$D$10003,SMALL(IF('quantities report'!$A$2:$A$10003=D$4,ROW('quantities report'!$A$2:$A$10003)-1,\"\"),ROWS($B$9:$B16))),\"0\")))","v":""},{"$f":"IF($B12=\"\",\"\",VALUE(IFERROR(INDEX('quantities report'!$D$2:$D$10003,SMALL(IF('quantities report'!$A$2:$A$10003=E$4,ROW('quantities report'!$A$2:$A$10003)-1,\"\"),ROWS($B$9:$B16))),\"0\")))","v":""},"","",{"$f":"IF($B12=\"\",\"\",IFERROR(INDEX('quantities report'!$D$2:$D$10003,SMALL(IF('quantities report'!$A$2:$A$10003=H$4,ROW('quantities report'!$A$2:$A$10003)-1,\"\"),ROWS($B$9:$B16))),\"0\"))","v":""},{"$f":"IF($B12=\"\",\"\",VALUE(IFERROR(INDEX('quantities report'!$D$2:$D$10003,SMALL(IF('quantities report'!$A$2:$A$10003=I$4,ROW('quantities report'!$A$2:$A$10003)-1,\"\"),ROWS($B$9:$B16))),\"0\")))","v":""},{"$f":"IF($B12=\"\",\"\",VALUE(IFERROR(INDEX('quantities report'!$D$2:$D$10003,SMALL(IF('quantities report'!$A$2:$A$10003=J$4,ROW('quantities report'!$A$2:$A$10003)-1,\"\"),ROWS($B$9:$B16))),\"0\")))","v":""},"",""]
[null,{"$f":"IFERROR(INDEX('manual inputs'!M:M,SMALL(IF('manual inputs'!M:M<>\"\",ROW('manual inputs'!M:M)),ROW(11:11))),\"\")","v":""},{"$f":"IF($B13=\"\",\"\",VALUE(IFERROR(INDEX('quantities report'!$D$2:$D$10003,SMALL(IF('quantities report'!$A$2:$A$10003=C$4,ROW('quantities report'!$A$2:$A$10003)-1,\"\"),ROWS($B$9:$B17))),\"0\")))","v":""},{"$f":"IF($B13=\"\",\"\",VALUE(IFERROR(INDEX('quantities report'!$D$2:$D$10003,SMALL(IF('quantities report'!$A$2:$A$10003=D$4,ROW('quantities report'!$A$2:$A$10003)-1,\"\"),ROWS($B$9:$B17))),\"0\")))","v":""},{"$f":"IF($B13=\"\",\"\",VALUE(IFERROR(INDEX('quantities report'!$D$2:$D$10003,SMALL(IF('quantities report'!$A$2:$A$10003=E$4,ROW('quantities report'!$A$2:$A$10003)-1,\"\"),ROWS($B$9:$B17))),\"0\")))","v":""},"","",{"$f":"IF($B13=\"\",\"\",IFERROR(INDEX('quantities report'!$D$2:$D$10003,SMALL(IF('quantities report'!$A$2:$A$10003=H$4,ROW('quantities report'!$A$2:$A$10003)-1,\"\"),ROWS($B$9:$B17))),\"0\"))","v":""},{"$f":"IF($B13=\"\",\"\",VALUE(IFERROR(INDEX('quantities report'!$D$2:$D$10003,SMALL(IF('quantities report'!$A$2:$A$10003=I$4,ROW('quantities report'!$A$2:$A$10003)-1,\"\"),ROWS($B$9:$B17))),\"0\")))","v":""},{"$f":"IF($B13=\"\",\"\",VALUE(IFERROR(INDEX('quantities report'!$D$2:$D$10003,SMALL(IF('quantities report'!$A$2:$A$10003=J$4,ROW('quantities report'!$A$2:$A$10003)-1,\"\"),ROWS($B$9:$B17))),\"0\")))","v":""},"",""]
[null,{"$f":"IFERROR(INDEX('manual inputs'!M:M,SMALL(IF('manual inputs'!M:M<>\"\",ROW('manual inputs'!M:M)),ROW(12:12))),\"\")","v":""},{"$f":"IF($B14=\"\",\"\",VALUE(IFERROR(INDEX('quantities report'!$D$2:$D$10003,SMALL(IF('quantities report'!$A$2:$A$10003=C$4,ROW('quantities report'!$A$2:$A$10003)-1,\"\"),ROWS($B$9:$B18))),\"0\")))","v":""},{"$f":"IF($B14=\"\",\"\",VALUE(IFERROR(INDEX('quantities report'!$D$2:$D$10003,SMALL(IF('quantities report'!$A$2:$A$10003=D$4,ROW('quantities report'!$A$2:$A$10003)-1,\"\"),ROWS($B$9:$B18))),\"0\")))","v":""},{"$f":"IF($B14=\"\",\"\",VALUE(IFERROR(INDEX('quantities report'!$D$2:$D$10003,SMALL(IF('quantities report'!$A$2:$A$10003=E$4,ROW('quantities report'!$A$2:$A$10003)-1,\"\"),ROWS($B$9:$B18))),\"0\")))","v":""},"","",{"$f":"IF($B14=\"\",\"\",IFERROR(INDEX('quantities report'!$D$2:$D$10003,SMALL(IF('quantities report'!$A$2:$A$10003=H$4,ROW('quantities report'!$A$2:$A$10003)-1,\"\"),ROWS($B$9:$B18))),\"0\"))","v":""},{"$f":"IF($B14=\"\",\"\",VALUE(IFERROR(INDEX('quantities report'!$D$2:$D$10003,SMALL(IF('quantities report'!$A$2:$A$10003=I$4,ROW('quantities report'!$A$2:$A$10003)-1,\"\"),ROWS($B$9:$B18))),\"0\")))","v":""},{"$f":"IF($B14=\"\",\"\",VALUE(IFERROR(INDEX('quantities report'!$D$2:$D$10003,SMALL(IF('quantities report'!$A$2:$A$10003=J$4,ROW('quantities report'!$A$2:$A$10003)-1,\"\"),ROWS($B$9:$B18))),\"0\")))","v":""},"",""]
[null,{"$f":"IFERROR(INDEX('manual inputs'!M:M,SMALL(IF('manual inputs'!M:M<>\"\",ROW('manual inputs'!M:M)),ROW(13:13))),\"\")","v":""},{"$f":"IF($B15=\"\",\"\",VALUE(IFERROR(INDEX('quantities report'!$D$2:$D$10003,SMALL(IF('quantities report'!$A$2:$A$10003=C$4,ROW('quantities report'!$A$2:$A$10003)-1,\"\"),ROWS($B$9:$B19))),\"0\")))","v":""},{"$f":"IF($B15=\"\",\"\",VALUE(IFERROR(INDEX('quantities report'!$D$2:$D$10003,SMALL(IF('quantities report'!$A$2:$A$10003=D$4,ROW('quantities report'!$A$2:$A$10003)-1,\"\"),ROWS($B$9:$B19))),\"0\")))","v":""},{"$f":"IF($B15=\"\",\"\",VALUE(IFERROR(INDEX('quantities report'!$D$2:$D$10003,SMALL(IF('quantities report'!$A$2:$A$10003=E$4,ROW('quantities report'!$A$2:$A$10003)-1,\"\"),ROWS($B$9:$B19))),\"0\")))","v":""},"","",{"$f":"IF($B15=\"\",\"\",IFERROR(INDEX('quantities report'!$D$2:$D$10003,SMALL(IF('quantities report'!$A$2:$A$10003=H$4,ROW('quantities report'!$A$2:$A$10003)-1,\"\"),ROWS($B$9:$B19))),\"0\"))","v":""},{"$f":"IF($B15=\"\",\"\",VALUE(IFERROR(INDEX('quantities report'!$D$2:$D$10003,SMALL(IF('quantities report'!$A$2:$A$10003=I$4,ROW('quantities report'!$A$2:$A$10003)-1,\"\"),ROWS($B$9:$B19))),\"0\")))","v":""},{"$f":"IF($B15=\"\",\"\",VALUE(IFERROR(INDEX('quantities report'!$D$2:$D$10003,SMALL(IF('quantities report'!$A$2:$A$10003=J$4,ROW('quantities report'!$A$2:$A$10003)-1,\"\"),ROWS($B$9:$B19))),\"0\")))","v":""},"",""]
[null,{"$f":"IFERROR(INDEX('manual inputs'!M:M,SMALL(IF('manual inputs'!M:M<>\"\",ROW('manual inputs'!M:M)),ROW(14:14))),\"\")","v":""},{"$f":"IF($B16=\"\",\"\",VALUE(IFERROR(INDEX('quantities report'!$D$2:$D$10003,SMALL(IF('quantities report'!$A$2:$A$10003=C$4,ROW('quantities report'!$A$2:$A$10003)-1,\"\"),ROWS($B$9:$B20))),\"0\")))","v":""},{"$f":"IF($B16=\"\",\"\",VALUE(IFERROR(INDEX('quantities report'!$D$2:$D$10003,SMALL(IF('quantities report'!$A$2:$A$10003=D$4,ROW('quantities report'!$A$2:$A$10003)-1,\"\"),ROWS($B$9:$B20))),\"0\")))","v":""},{"$f":"IF($B16=\"\",\"\",VALUE(IFERROR(INDEX('quantities report'!$D$2:$D$10003,SMALL(IF('quantities report'!$A$2:$A$10003=E$4,ROW('quantities report'!$A$2:$A$10003)-1,\"\"),ROWS($B$9:$B20))),\"0\")))","v":""},"","",{"$f":"IF($B16=\"\",\"\",IFERROR(INDEX('quantities report'!$D$2:$D$10003,SMALL(IF('quantities report'!$A$2:$A$10003=H$4,ROW('quantities report'!$A$2:$A$10003)-1,\"\"),ROWS($B$9:$B20))),\"0\"))","v":""},{"$f":"IF($B16=\"\",\"\",VALUE(IFERROR(INDEX('quantities report'!$D$2:$D$10003,SMALL(IF('quantities report'!$A$2:$A$10003=I$4,ROW('quantities report'!$A$2:$A$10003)-1,\"\"),ROWS($B$9:$B20))),\"0\")))","v":""},{"$f":"IF($B16=\"\",\"\",VALUE(IFERROR(INDEX('quantities report'!$D$2:$D$10003,SMALL(IF('quantities report'!$A$2:$A$10003=J$4,ROW('quantities report'!$A$2:$A$10003)-1,\"\"),ROWS($B$9:$B20))),\"0\")))","v":""},"",""]
[null,{"$f":"IFERROR(INDEX('manual inputs'!M:M,SMALL(IF('manual inputs'!M:M<>\"\",ROW('manual inputs'!M:M)),ROW(15:15))),\"\")","v":""},{"$f":"IF($B17=\"\",\"\",VALUE(IFERROR(INDEX('quantities report'!$D$2:$D$10003,SMALL(IF('quantities report'!$A$2:$A$10003=C$4,ROW('quantities report'!$A$2:$A$10003)-1,\"\"),ROWS($B$9:$B21))),\"0\")))","v":""},{"$f":"IF($B17=\"\",\"\",VALUE(IFERROR(INDEX('quantities report'!$D$2:$D$10003,SMALL(IF('quantities report'!$A$2:$A$10003=D$4,ROW('quantities report'!$A$2:$A$10003)-1,\"\"),ROWS($B$9:$B21))),\"0\")))","v":""},{"$f":"IF($B17=\"\",\"\",VALUE(IFERROR(INDEX('quantities report'!$D$2:$D$10003,SMALL(IF('quantities report'!$A$2:$A$10003=E$4,ROW('quantities report'!$A$2:$A$10003)-1,\"\"),ROWS($B$9:$B21))),\"0\")))","v":""},"","",{"$f":"IF($B17=\"\",\"\",IFERROR(INDEX('quantities report'!$D$2:$D$10003,SMALL(IF('quantities report'!$A$2:$A$10003=H$4,ROW('quantities report'!$A$2:$A$10003)-1,\"\"),ROWS($B$9:$B21))),\"0\"))","v":""},{"$f":"IF($B17=\"\",\"\",VALUE(IFERROR(INDEX('quantities report'!$D$2:$D$10003,SMALL(IF('quantities report'!$A$2:$A$10003=I$4,ROW('quantities report'!$A$2:$A$10003)-1,\"\"),ROWS($B$9:$B21))),\"0\")))","v":""},{"$f":"IF($B17=\"\",\"\",VALUE(IFERROR(INDEX('quantities report'!$D$2:$D$10003,SMALL(IF('quantities report'!$A$2:$A$10003=J$4,ROW('quantities report'!$A$2:$A$10003)-1,\"\"),ROWS($B$9:$B21))),\"0\")))","v":""},"",""]
[null,{"$f":"IFERROR(INDEX('manual inputs'!M:M,SMALL(IF('manual inputs'!M:M<>\"\",ROW('manual inputs'!M:M)),ROW(16:16))),\"\")","v":""},{"$f":"IF($B18=\"\",\"\",VALUE(IFERROR(INDEX('quantities report'!$D$2:$D$10003,SMALL(IF('quantities report'!$A$2:$A$10003=C$4,ROW('quantities report'!$A$2:$A$10003)-1,\"\"),ROWS($B$9:$B22))),\"0\")))","v":""},{"$f":"IF($B18=\"\",\"\",VALUE(IFERROR(INDEX('quantities report'!$D$2:$D$10003,SMALL(IF('quantities report'!$A$2:$A$10003=D$4,ROW('quantities report'!$A$2:$A$10003)-1,\"\"),ROWS($B$9:$B22))),\"0\")))","v":""},{"$f":"IF($B18=\"\",\"\",VALUE(IFERROR(INDEX('quantities report'!$D$2:$D$10003,SMALL(IF('quantities report'!$A$2:$A$10003=E$4,ROW('quantities report'!$A$2:$A$10003)-1,\"\"),ROWS($B$9:$B22))),\"0\")))","v":""},"","",{"$f":"IF($B18=\"\",\"\",IFERROR(INDEX('quantities report'!$D$2:$D$10003,SMALL(IF('quantities report'!$A$2:$A$10003=H$4,ROW('quantities report'!$A$2:$A$10003)-1,\"\"),ROWS($B$9:$B22))),\"0\"))","v":""},{"$f":"IF($B18=\"\",\"\",VALUE(IFERROR(INDEX('quantities report'!$D$2:$D$10003,SMALL(IF('quantities report'!$A$2:$A$10003=I$4,ROW('quantities report'!$A$2:$A$10003)-1,\"\"),ROWS($B$9:$B22))),\"0\")))","v":""},{"$f":"IF($B18=\"\",\"\",VALUE(IFERROR(INDEX('quantities report'!$D$2:$D$10003,SMALL(IF('quantities report'!$A$2:$A$10003=J$4,ROW('quantities report'!$A$2:$A$10003)-1,\"\"),ROWS($B$9:$B22))),\"0\")))","v":""},"",""]
[null,{"$f":"IFERROR(INDEX('manual inputs'!M:M,SMALL(IF('manual inputs'!M:M<>\"\",ROW('manual inputs'!M:M)),ROW(17:17))),\"\")","v":""},{"$f":"IF($B19=\"\",\"\",VALUE(IFERROR(INDEX('quantities report'!$D$2:$D$10003,SMALL(IF('quantities report'!$A$2:$A$10003=C$4,ROW('quantities report'!$A$2:$A$10003)-1,\"\"),ROWS($B$9:$B23))),\"0\")))","v":""},{"$f":"IF($B19=\"\",\"\",VALUE(IFERROR(INDEX('quantities report'!$D$2:$D$10003,SMALL(IF('quantities report'!$A$2:$A$10003=D$4,ROW('quantities report'!$A$2:$A$10003)-1,\"\"),ROWS($B$9:$B23))),\"0\")))","v":""},{"$f":"IF($B19=\"\",\"\",VALUE(IFERROR(INDEX('quantities report'!$D$2:$D$10003,SMALL(IF('quantities report'!$A$2:$A$10003=E$4,ROW('quantities report'!$A$2:$A$10003)-1,\"\"),ROWS($B$9:$B23))),\"0\")))","v":""},"","",{"$f":"IF($B19=\"\",\"\",IFERROR(INDEX('quantities report'!$D$2:$D$10003,SMALL(IF('quantities report'!$A$2:$A$10003=H$4,ROW('quantities report'!$A$2:$A$10003)-1,\"\"),ROWS($B$9:$B23))),\"0\"))","v":""},{"$f":"IF($B19=\"\",\"\",VALUE(IFERROR(INDEX('quantities report'!$D$2:$D$10003,SMALL(IF('quantities report'!$A$2:$A$10003=I$4,ROW('quantities report'!$A$2:$A$10003)-1,\"\"),ROWS($B$9:$B23))),\"0\")))","v":""},{"$f":"IF($B19=\"\",\"\",VALUE(IFERROR(INDEX('quantities report'!$D$2:$D$10003,SMALL(IF('quantities report'!$A$2:$A$10003=J$4,ROW('quantities report'!$A$2:$A$10003)-1,\"\"),ROWS($B$9:$B23))),\"0\")))","v":""},"",""]
[null,{"$f":"IFERROR(INDEX('manual inputs'!M:M,SMALL(IF('manual inputs'!M:M<>\"\",ROW('manual inputs'!M:M)),ROW(18:18))),\"\")","v":""},{"$f":"IF($B20=\"\",\"\",VALUE(IFERROR(INDEX('quantities report'!$D$2:$D$10003,SMALL(IF('quantities report'!$A$2:$A$10003=C$4,ROW('quantities report'!$A$2:$A$10003)-1,\"\"),ROWS($B$9:$B24))),\"0\")))","v":""},{"$f":"IF($B20=\"\",\"\",VALUE(IFERROR(INDEX('quantities report'!$D$2:$D$10003,SMALL(IF('quantities report'!$A$2:$A$10003=D$4,ROW('quantities report'!$A$2:$A$10003)-1,\"\"),ROWS($B$9:$B24))),\"0\")))","v":""},{"$f":"IF($B20=\"\",\"\",VALUE(IFERROR(INDEX('quantities report'!$D$2:$D$10003,SMALL(IF('quantities report'!$A$2:$A$10003=E$4,ROW('quantities report'!$A$2:$A$10003)-1,\"\"),ROWS($B$9:$B24))),\"0\")))","v":""},"","",{"$f":"IF($B20=\"\",\"\",IFERROR(INDEX('quantities report'!$D$2:$D$10003,SMALL(IF('quantities report'!$A$2:$A$10003=H$4,ROW('quantities report'!$A$2:$A$10003)-1,\"\"),ROWS($B$9:$B24))),\"0\"))","v":""},{"$f":"IF($B20=\"\",\"\",VALUE(IFERROR(INDEX('quantities report'!$D$2:$D$10003,SMALL(IF('quantities report'!$A$2:$A$10003=I$4,ROW('quantities report'!$A$2:$A$10003)-1,\"\"),ROWS($B$9:$B24))),\"0\")))","v":""},{"$f":"IF($B20=\"\",\"\",VALUE(IFERROR(INDEX('quantities report'!$D$2:$D$10003,SMALL(IF('quantities report'!$A$2:$A$10003=J$4,ROW('quantities report'!$A$2:$A$10003)-1,\"\"),ROWS($B$9:$B24))),\"0\")))","v":""},"",""]
[null,{"$f":"IFERROR(INDEX('manual inputs'!M:M,SMALL(IF('manual inputs'!M:M<>\"\",ROW('manual inputs'!M:M)),ROW(19:19))),\"\")","v":""},{"$f":"IF($B21=\"\",\"\",VALUE(IFERROR(INDEX('quantities report'!$D$2:$D$10003,SMALL(IF('quantities report'!$A$2:$A$10003=C$4,ROW('quantities report'!$A$2:$A$10003)-1,\"\"),ROWS($B$9:$B25))),\"0\")))","v":""},{"$f":"IF($B21=\"\",\"\",VALUE(IFERROR(INDEX('quantities report'!$D$2:$D$10003,SMALL(IF('quantities report'!$A$2:$A$10003=D$4,ROW('quantities report'!$A$2:$A$10003)-1,\"\"),ROWS($B$9:$B25))),\"0\")))","v":""},{"$f":"IF($B21=\"\",\"\",VALUE(IFERROR(INDEX('quantities report'!$D$2:$D$10003,SMALL(IF('quantities report'!$A$2:$A$10003=E$4,ROW('quantities report'!$A$2:$A$10003)-1,\"\"),ROWS($B$9:$B25))),\"0\")))","v":""},"","",{"$f":"IF($B21=\"\",\"\",IFERROR(INDEX('quantities report'!$D$2:$D$10003,SMALL(IF('quantities report'!$A$2:$A$10003=H$4,ROW('quantities report'!$A$2:$A$10003)-1,\"\"),ROWS($B$9:$B25))),\"0\"))","v":""},{"$f":"IF($B21=\"\",\"\",VALUE(IFERROR(INDEX('quantities report'!$D$2:$D$10003,SMALL(IF('quantities report'!$A$2:$A$10003=I$4,ROW('quantities report'!$A$2:$A$10003)-1,\"\"),ROWS($B$9:$B25))),\"0\")))","v":""},{"$f":"IF($B21=\"\",\"\",VALUE(IFERROR(INDEX('quantities report'!$D$2:$D$10003,SMALL(IF('quantities report'!$A$2:$A$10003=J$4,ROW('quantities report'!$A$2:$A$10003)-1,\"\"),ROWS($B$9:$B25))),\"0\")))","v":""},"",""]
[null,{"$f":"IFERROR(INDEX('manual inputs'!M:M,SMALL(IF('manual inputs'!M:M<>\"\",ROW('manual inputs'!M:M)),ROW(20:20))),\"\")","v":""},{"$f":"IF($B22=\"\",\"\",VALUE(IFERROR(INDEX('quantities report'!$D$2:$D$10003,SMALL(IF('quantities report'!$A$2:$A$10003=C$4,ROW('quantities report'!$A$2:$A$10003)-1,\"\"),ROWS($B$9:$B26))),\"0\")))","v":""},{"$f":"IF($B22=\"\",\"\",VALUE(IFERROR(INDEX('quantities report'!$D$2:$D$10003,SMALL(IF('quantities report'!$A$2:$A$10003=D$4,ROW('quantities report'!$A$2:$A$10003)-1,\"\"),ROWS($B$9:$B26))),\"0\")))","v":""},{"$f":"IF($B22=\"\",\"\",VALUE(IFERROR(INDEX('quantities report'!$D$2:$D$10003,SMALL(IF('quantities report'!$A$2:$A$10003=E$4,ROW('quantities report'!$A$2:$A$10003)-1,\"\"),ROWS($B$9:$B26))),\"0\")))","v":""},"","",{"$f":"IF($B22=\"\",\"\",IFERROR(INDEX('quantities report'!$D$2:$D$10003,SMALL(IF('quantities report'!$A$2:$A$10003=H$4,ROW('quantities report'!$A$2:$A$10003)-1,\"\"),ROWS($B$9:$B26))),\"0\"))","v":""},{"$f":"IF($B22=\"\",\"\",VALUE(IFERROR(INDEX('quantities report'!$D$2:$D$10003,SMALL(IF('quantities report'!$A$2:$A$10003=I$4,ROW('quantities report'!$A$2:$A$10003)-1,\"\"),ROWS($B$9:$B26))),\"0\")))","v":""},{"$f":"IF($B22=\"\",\"\",VALUE(IFERROR(INDEX('quantities report'!$D$2:$D$10003,SMALL(IF('quantities report'!$A$2:$A$10003=J$4,ROW('quantities report'!$A$2:$A$10003)-1,\"\"),ROWS($B$9:$B26))),\"0\")))","v":""},"",""]
[null,{"$f":"IFERROR(INDEX('manual inputs'!M:M,SMALL(IF('manual inputs'!M:M<>\"\",ROW('manual inputs'!M:M)),ROW(21:21))),\"\")","v":""},{"$f":"IF($B23=\"\",\"\",VALUE(IFERROR(INDEX('quantities report'!$D$2:$D$10003,SMALL(IF('quantities report'!$A$2:$A$10003=C$4,ROW('quantities report'!$A$2:$A$10003)-1,\"\"),ROWS($B$9:$B27))),\"0\")))","v":""},{"$f":"IF($B23=\"\",\"\",VALUE(IFERROR(INDEX('quantities report'!$D$2:$D$10003,SMALL(IF('quantities report'!$A$2:$A$10003=D$4,ROW('quantities report'!$A$2:$A$10003)-1,\"\"),ROWS($B$9:$B27))),\"0\")))","v":""},{"$f":"IF($B23=\"\",\"\",VALUE(IFERROR(INDEX('quantities report'!$D$2:$D$10003,SMALL(IF('quantities report'!$A$2:$A$10003=E$4,ROW('quantities report'!$A$2:$A$10003)-1,\"\"),ROWS($B$9:$B27))),\"0\")))","v":""},"","",{"$f":"IF($B23=\"\",\"\",IFERROR(INDEX('quantities report'!$D$2:$D$10003,SMALL(IF('quantities report'!$A$2:$A$10003=H$4,ROW('quantities report'!$A$2:$A$10003)-1,\"\"),ROWS($B$9:$B27))),\"0\"))","v":""},{"$f":"IF($B23=\"\",\"\",VALUE(IFERROR(INDEX('quantities report'!$D$2:$D$10003,SMALL(IF('quantities report'!$A$2:$A$10003=I$4,ROW('quantities report'!$A$2:$A$10003)-1,\"\"),ROWS($B$9:$B27))),\"0\")))","v":""},{"$f":"IF($B23=\"\",\"\",VALUE(IFERROR(INDEX('quantities report'!$D$2:$D$10003,SMALL(IF('quantities report'!$A$2:$A$10003=J$4,ROW('quantities report'!$A$2:$A$10003)-1,\"\"),ROWS($B$9:$B27))),\"0\")))","v":""},"",""]
[null,{"$f":"IFERROR(INDEX('manual inputs'!M:M,SMALL(IF('manual inputs'!M:M<>\"\",ROW('manual inputs'!M:M)),ROW(22:22))),\"\")","v":""},{"$f":"IF($B24=\"\",\"\",VALUE(IFERROR(INDEX('quantities report'!$D$2:$D$10003,SMALL(IF('quantities report'!$A$2:$A$10003=C$4,ROW('quantities report'!$A$2:$A$10003)-1,\"\"),ROWS($B$9:$B28))),\"0\")))","v":""},{"$f":"IF($B24=\"\",\"\",VALUE(IFERROR(INDEX('quantities report'!$D$2:$D$10003,SMALL(IF('quantities report'!$A$2:$A$10003=D$4,ROW('quantities report'!$A$2:$A$10003)-1,\"\"),ROWS($B$9:$B28))),\"0\")))","v":""},{"$f":"IF($B24=\"\",\"\",VALUE(IFERROR(INDEX('quantities report'!$D$2:$D$10003,SMALL(IF('quantities report'!$A$2:$A$10003=E$4,ROW('quantities report'!$A$2:$A$10003)-1,\"\"),ROWS($B$9:$B28))),\"0\")))","v":""},"","",{"$f":"IF($B24=\"\",\"\",IFERROR(INDEX('quantities report'!$D$2:$D$10003,SMALL(IF('quantities report'!$A$2:$A$10003=H$4,ROW('quantities report'!$A$2:$A$10003)-1,\"\"),ROWS($B$9:$B28))),\"0\"))","v":""},{"$f":"IF($B24=\"\",\"\",VALUE(IFERROR(INDEX('quantities report'!$D$2:$D$10003,SMALL(IF('quantities report'!$A$2:$A$10003=I$4,ROW('quantities report'!$A$2:$A$10003)-1,\"\"),ROWS($B$9:$B28))),\"0\")))","v":""},{"$f":"IF($B24=\"\",\"\",VALUE(IFERROR(INDEX('quantities report'!$D$2:$D$10003,SMALL(IF('quantities report'!$A$2:$A$10003=J$4,ROW('quantities report'!$A$2:$A$10003)-1,\"\"),ROWS($B$9:$B28))),\"0\")))","v":""},"",""]
[null,{"$f":"IFERROR(INDEX('manual inputs'!M:M,SMALL(IF('manual inputs'!M:M<>\"\",ROW('manual inputs'!M:M)),ROW(23:23))),\"\")","v":""},{"$f":"IF($B25=\"\",\"\",VALUE(IFERROR(INDEX('quantities report'!$D$2:$D$10003,SMALL(IF('quantities report'!$A$2:$A$10003=C$4,ROW('quantities report'!$A$2:$A$10003)-1,\"\"),ROWS($B$9:$B29))),\"0\")))","v":""},{"$f":"IF($B25=\"\",\"\",VALUE(IFERROR(INDEX('quantities report'!$D$2:$D$10003,SMALL(IF('quantities report'!$A$2:$A$10003=D$4,ROW('quantities report'!$A$2:$A$10003)-1,\"\"),ROWS($B$9:$B29))),\"0\")))","v":""},{"$f":"IF($B25=\"\",\"\",VALUE(IFERROR(INDEX('quantities report'!$D$2:$D$10003,SMALL(IF('quantities report'!$A$2:$A$10003=E$4,ROW('quantities report'!$A$2:$A$10003)-1,\"\"),ROWS($B$9:$B29))),\"0\")))","v":""},"","",{"$f":"IF($B25=\"\",\"\",IFERROR(INDEX('quantities report'!$D$2:$D$10003,SMALL(IF('quantities report'!$A$2:$A$10003=H$4,ROW('quantities report'!$A$2:$A$10003)-1,\"\"),ROWS($B$9:$B29))),\"0\"))","v":""},{"$f":"IF($B25=\"\",\"\",VALUE(IFERROR(INDEX('quantities report'!$D$2:$D$10003,SMALL(IF('quantities report'!$A$2:$A$10003=I$4,ROW('quantities report'!$A$2:$A$10003)-1,\"\"),ROWS($B$9:$B29))),\"0\")))","v":""},{"$f":"IF($B25=\"\",\"\",VALUE(IFERROR(INDEX('quantities report'!$D$2:$D$10003,SMALL(IF('quantities report'!$A$2:$A$10003=J$4,ROW('quantities report'!$A$2:$A$10003)-1,\"\"),ROWS($B$9:$B29))),\"0\")))","v":""},"",""]
[null,{"$f":"IFERROR(INDEX('manual inputs'!M:M,SMALL(IF('manual inputs'!M:M<>\"\",ROW('manual inputs'!M:M)),ROW(24:24))),\"\")","v":""},{"$f":"IF($B26=\"\",\"\",VALUE(IFERROR(INDEX('quantities report'!$D$2:$D$10003,SMALL(IF('quantities report'!$A$2:$A$10003=C$4,ROW('quantities report'!$A$2:$A$10003)-1,\"\"),ROWS($B$9:$B30))),\"0\")))","v":""},{"$f":"IF($B26=\"\",\"\",VALUE(IFERROR(INDEX('quantities report'!$D$2:$D$10003,SMALL(IF('quantities report'!$A$2:$A$10003=D$4,ROW('quantities report'!$A$2:$A$10003)-1,\"\"),ROWS($B$9:$B30))),\"0\")))","v":""},{"$f":"IF($B26=\"\",\"\",VALUE(IFERROR(INDEX('quantities report'!$D$2:$D$10003,SMALL(IF('quantities report'!$A$2:$A$10003=E$4,ROW('quantities report'!$A$2:$A$10003)-1,\"\"),ROWS($B$9:$B30))),\"0\")))","v":""},"","",{"$f":"IF($B26=\"\",\"\",IFERROR(INDEX('quantities report'!$D$2:$D$10003,SMALL(IF('quantities report'!$A$2:$A$10003=H$4,ROW('quantities report'!$A$2:$A$10003)-1,\"\"),ROWS($B$9:$B30))),\"0\"))","v":""},{"$f":"IF($B26=\"\",\"\",VALUE(IFERROR(INDEX('quantities report'!$D$2:$D$10003,SMALL(IF('quantities report'!$A$2:$A$10003=I$4,ROW('quantities report'!$A$2:$A$10003)-1,\"\"),ROWS($B$9:$B30))),\"0\")))","v":""},{"$f":"IF($B26=\"\",\"\",VALUE(IFERROR(INDEX('quantities report'!$D$2:$D$10003,SMALL(IF('quantities report'!$A$2:$A$10003=J$4,ROW('quantities report'!$A$2:$A$10003)-1,\"\"),ROWS($B$9:$B30))),\"0\")))","v":""},"",""]
[null,{"$f":"IFERROR(INDEX('manual inputs'!M:M,SMALL(IF('manual inputs'!M:M<>\"\",ROW('manual inputs'!M:M)),ROW(25:25))),\"\")","v":""},{"$f":"IF($B27=\"\",\"\",VALUE(IFERROR(INDEX('quantities report'!$D$2:$D$10003,SMALL(IF('quantities report'!$A$2:$A$10003=C$4,ROW('quantities report'!$A$2:$A$10003)-1,\"\"),ROWS($B$9:$B31))),\"0\")))","v":""},{"$f":"IF($B27=\"\",\"\",VALUE(IFERROR(INDEX('quantities report'!$D$2:$D$10003,SMALL(IF('quantities report'!$A$2:$A$10003=D$4,ROW('quantities report'!$A$2:$A$10003)-1,\"\"),ROWS($B$9:$B31))),\"0\")))","v":""},{"$f":"IF($B27=\"\",\"\",VALUE(IFERROR(INDEX('quantities report'!$D$2:$D$10003,SMALL(IF('quantities report'!$A$2:$A$10003=E$4,ROW('quantities report'!$A$2:$A$10003)-1,\"\"),ROWS($B$9:$B31))),\"0\")))","v":""},"","",{"$f":"IF($B27=\"\",\"\",IFERROR(INDEX('quantities report'!$D$2:$D$10003,SMALL(IF('quantities report'!$A$2:$A$10003=H$4,ROW('quantities report'!$A$2:$A$10003)-1,\"\"),ROWS($B$9:$B31))),\"0\"))","v":""},{"$f":"IF($B27=\"\",\"\",VALUE(IFERROR(INDEX('quantities report'!$D$2:$D$10003,SMALL(IF('quantities report'!$A$2:$A$10003=I$4,ROW('quantities report'!$A$2:$A$10003)-1,\"\"),ROWS($B$9:$B31))),\"0\")))","v":""},{"$f":"IF($B27=\"\",\"\",VALUE(IFERROR(INDEX('quantities report'!$D$2:$D$10003,SMALL(IF('quantities report'!$A$2:$A$10003=J$4,ROW('quantities report'!$A$2:$A$10003)-1,\"\"),ROWS($B$9:$B31))),\"0\")))","v":""},"",""]
[null,{"$f":"IFERROR(INDEX('manual inputs'!M:M,SMALL(IF('manual inputs'!M:M<>\"\",ROW('manual inputs'!M:M)),ROW(26:26))),\"\")","v":""},{"$f":"IF($B28=\"\",\"\",VALUE(IFERROR(INDEX('quantities report'!$D$2:$D$10003,SMALL(IF('quantities report'!$A$2:$A$10003=C$4,ROW('quantities report'!$A$2:$A$10003)-1,\"\"),ROWS($B$9:$B32))),\"0\")))","v":""},{"$f":"IF($B28=\"\",\"\",VALUE(IFERROR(INDEX('quantities report'!$D$2:$D$10003,SMALL(IF('quantities report'!$A$2:$A$10003=D$4,ROW('quantities report'!$A$2:$A$10003)-1,\"\"),ROWS($B$9:$B32))),\"0\")))","v":""},{"$f":"IF($B28=\"\",\"\",VALUE(IFERROR(INDEX('quantities report'!$D$2:$D$10003,SMALL(IF('quantities report'!$A$2:$A$10003=E$4,ROW('quantities report'!$A$2:$A$10003)-1,\"\"),ROWS($B$9:$B32))),\"0\")))","v":""},"","",{"$f":"IF($B28=\"\",\"\",IFERROR(INDEX('quantities report'!$D$2:$D$10003,SMALL(IF('quantities report'!$A$2:$A$10003=H$4,ROW('quantities report'!$A$2:$A$10003)-1,\"\"),ROWS($B$9:$B32))),\"0\"))","v":""},{"$f":"IF($B28=\"\",\"\",VALUE(IFERROR(INDEX('quantities report'!$D$2:$D$10003,SMALL(IF('quantities report'!$A$2:$A$10003=I$4,ROW('quantities report'!$A$2:$A$10003)-1,\"\"),ROWS($B$9:$B32))),\"0\")))","v":""},{"$f":"IF($B28=\"\",\"\",VALUE(IFERROR(INDEX('quantities report'!$D$2:$D$10003,SMALL(IF('quantities report'!$A$2:$A$10003=J$4,ROW('quantities report'!$A$2:$A$10003)-1,\"\"),ROWS($B$9:$B32))),\"0\")))","v":""},"",""]

{"sheet":"Structure_Ex","index":6,"n_rows":32,"n_cols":9,"rows_kept":32,"cut":false,"hidden":false,"merged":[[3,2,3,7],[3,8,5,8]]}
[]
[]
["TOTALS",null,{"$f":"SUM(C8:C32)","v":0},0,0,0,0,0,0]
[null,null,"Structure Excavation",null,null,null,null,null,"Total"]
[null,null,"Soil Nail","MSE Wall","GFMSE Wall","Rockery Wall","Concrete Walls","Guardwall"]
["ORD Component Name",null,"XS_TC_Soil Nail Wall Excavation: ","XS_TC_MSE Wall Excavation: ","XS_TC_GFMSE Wall Excavation: ","XS_TC_Rockery Wall Excavation: ","XS_TC_Wall Excavation: ","XS_TL_Guard Wall Excavation:"]
["Enter Start of Project",{"$f":"IFERROR(INDEX('manual inputs'!M:M,SMALL(IF('manual inputs'!M:M<>\"\",ROW('manual inputs'!M:M)),ROW(2:2))),\"\")","v":""}]
[null,{"$f":"IFERROR(INDEX('manual inputs'!M:M,SMALL(IF('manual inputs'!M:M<>\"\",ROW('manual inputs'!M:M)),ROW(3:3))),\"\")","v":""},{"$f":"IF($B8=\"\",\"\",IFERROR(INDEX('quantities report'!$D$2:$D$10003,SMALL(IF('quantities report'!$A$2:$A$10003=C$6,ROW('quantities report'!$A$2:$A$10003)-1,\"\"),ROWS($B$8:$B8))),\"0\"))","v":""},{"$f":"IF($B8=\"\",\"\",IFERROR(INDEX('quantities report'!$D$2:$D$10003,SMALL(IF('quantities report'!$A$2:$A$10003=D$6,ROW('quantities report'!$A$2:$A$10003)-1,\"\"),ROWS($B$8:$B8))),\"0\"))","v":""},{"$f":"IF($B8=\"\",\"\",IFERROR(INDEX('quantities report'!$D$2:$D$10003,SMALL(IF('quantities report'!$A$2:$A$10003=E$6,ROW('quantities report'!$A$2:$A$10003)-1,\"\"),ROWS($B$8:$B8))),\"0\"))","v":""},{"$f":"IF($B8=\"\",\"\",IFERROR(INDEX('quantities report'!$D$2:$D$10003,SMALL(IF('quantities report'!$A$2:$A$10003=F$6,ROW('quantities report'!$A$2:$A$10003)-1,\"\"),ROWS($B$8:$B8))),\"0\"))","v":""},{"$f":"IF($B8=\"\",\"\",IFERROR(INDEX('quantities report'!$D$2:$D$10003,SMALL(IF('quantities report'!$A$2:$A$10003=G$6,ROW('quantities report'!$A$2:$A$10003)-1,\"\"),ROWS($B$8:$B8))),\"0\"))","v":""},{"$f":"IF($B8=\"\",\"\",IFERROR(INDEX('quantities report'!$D$2:$D$10003,SMALL(IF('quantities report'!$A$2:$A$10003=H$6,ROW('quantities report'!$A$2:$A$10003)-1,\"\"),ROWS($B$8:$B8))),\"0\"))","v":""},{"$f":"IF(B8=\"\",\"\",SUM(C8:H8))","v":""}]
[null,{"$f":"IFERROR(INDEX('manual inputs'!M:M,SMALL(IF('manual inputs'!M:M<>\"\",ROW('manual inputs'!M:M)),ROW(4:4))),\"\")","v":""},{"$f":"IF($B9=\"\",\"\",IFERROR(INDEX('quantities report'!$D$2:$D$10003,SMALL(IF('quantities report'!$A$2:$A$10003=C$6,ROW('quantities report'!$A$2:$A$10003)-1,\"\"),ROWS($B$8:$B9))),\"0\"))","v":""},{"$f":"IF($B9=\"\",\"\",IFERROR(INDEX('quantities report'!$D$2:$D$10003,SMALL(IF('quantities report'!$A$2:$A$10003=D$6,ROW('quantities report'!$A$2:$A$10003)-1,\"\"),ROWS($B$8:$B9))),\"0\"))","v":""},{"$f":"IF($B9=\"\",\"\",IFERROR(INDEX('quantities report'!$D$2:$D$10003,SMALL(IF('quantities report'!$A$2:$A$10003=E$6,ROW('quantities report'!$A$2:$A$10003)-1,\"\"),ROWS($B$8:$B9))),\"0\"))","v":""},{"$f":"IF($B9=\"\",\"\",IFERROR(INDEX('quantities report'!$D$2:$D$10003,SMALL(IF('quantities report'!$A$2:$A$10003=F$6,ROW('quantities report'!$A$2:$A$10003)-1,\"\"),ROWS($B$8:$B9))),\"0\"))","v":""},{"$f":"IF($B9=\"\",\"\",IFERROR(INDEX('quantities report'!$D$2:$D$10003,SMALL(IF('quantities report'!$A$2:$A$10003=G$6,ROW('quantities report'!$A$2:$A$10003)-1,\"\"),ROWS($B$8:$B9))),\"0\"))","v":""},{"$f":"IF($B9=\"\",\"\",IFERROR(INDEX('quantities report'!$D$2:$D$10003,SMALL(IF('quantities report'!$A$2:$A$10003=H$6,ROW('quantities report'!$A$2:$A$10003)-1,\"\"),ROWS($B$8:$B9))),\"0\"))","v":""},{"$f":"IF(B9=\"\",\"\",SUM(C9:H9))","v":""}]
[null,{"$f":"IFERROR(INDEX('manual inputs'!M:M,SMALL(IF('manual inputs'!M:M<>\"\",ROW('manual inputs'!M:M)),ROW(5:5))),\"\")","v":""},{"$f":"IF($B10=\"\",\"\",IFERROR(INDEX('quantities report'!$D$2:$D$10003,SMALL(IF('quantities report'!$A$2:$A$10003=C$6,ROW('quantities report'!$A$2:$A$10003)-1,\"\"),ROWS($B$8:$B10))),\"0\"))","v":""},{"$f":"IF($B10=\"\",\"\",IFERROR(INDEX('quantities report'!$D$2:$D$10003,SMALL(IF('quantities report'!$A$2:$A$10003=D$6,ROW('quantities report'!$A$2:$A$10003)-1,\"\"),ROWS($B$8:$B10))),\"0\"))","v":""},{"$f":"IF($B10=\"\",\"\",IFERROR(INDEX('quantities report'!$D$2:$D$10003,SMALL(IF('quantities report'!$A$2:$A$10003=E$6,ROW('quantities report'!$A$2:$A$10003)-1,\"\"),ROWS($B$8:$B10))),\"0\"))","v":""},{"$f":"IF($B10=\"\",\"\",IFERROR(INDEX('quantities report'!$D$2:$D$10003,SMALL(IF('quantities report'!$A$2:$A$10003=F$6,ROW('quantities report'!$A$2:$A$10003)-1,\"\"),ROWS($B$8:$B10))),\"0\"))","v":""},{"$f":"IF($B10=\"\",\"\",IFERROR(INDEX('quantities report'!$D$2:$D$10003,SMALL(IF('quantities report'!$A$2:$A$10003=G$6,ROW('quantities report'!$A$2:$A$10003)-1,\"\"),ROWS($B$8:$B10))),\"0\"))","v":""},{"$f":"IF($B10=\"\",\"\",IFERROR(INDEX('quantities report'!$D$2:$D$10003,SMALL(IF('quantities report'!$A$2:$A$10003=H$6,ROW('quantities report'!$A$2:$A$10003)-1,\"\"),ROWS($B$8:$B10))),\"0\"))","v":""},{"$f":"IF(B10=\"\",\"\",SUM(C10:H10))","v":""}]
[null,{"$f":"IFERROR(INDEX('manual inputs'!M:M,SMALL(IF('manual inputs'!M:M<>\"\",ROW('manual inputs'!M:M)),ROW(6:6))),\"\")","v":""},{"$f":"IF($B11=\"\",\"\",IFERROR(INDEX('quantities report'!$D$2:$D$10003,SMALL(IF('quantities report'!$A$2:$A$10003=C$6,ROW('quantities report'!$A$2:$A$10003)-1,\"\"),ROWS($B$8:$B11))),\"0\"))","v":""},{"$f":"IF($B11=\"\",\"\",IFERROR(INDEX('quantities report'!$D$2:$D$10003,SMALL(IF('quantities report'!$A$2:$A$10003=D$6,ROW('quantities report'!$A$2:$A$10003)-1,\"\"),ROWS($B$8:$B11))),\"0\"))","v":""},{"$f":"IF($B11=\"\",\"\",IFERROR(INDEX('quantities report'!$D$2:$D$10003,SMALL(IF('quantities report'!$A$2:$A$10003=E$6,ROW('quantities report'!$A$2:$A$10003)-1,\"\"),ROWS($B$8:$B11))),\"0\"))","v":""},{"$f":"IF($B11=\"\",\"\",IFERROR(INDEX('quantities report'!$D$2:$D$10003,SMALL(IF('quantities report'!$A$2:$A$10003=F$6,ROW('quantities report'!$A$2:$A$10003)-1,\"\"),ROWS($B$8:$B11))),\"0\"))","v":""},{"$f":"IF($B11=\"\",\"\",IFERROR(INDEX('quantities report'!$D$2:$D$10003,SMALL(IF('quantities report'!$A$2:$A$10003=G$6,ROW('quantities report'!$A$2:$A$10003)-1,\"\"),ROWS($B$8:$B11))),\"0\"))","v":""},{"$f":"IF($B11=\"\",\"\",IFERROR(INDEX('quantities report'!$D$2:$D$10003,SMALL(IF('quantities report'!$A$2:$A$10003=H$6,ROW('quantities report'!$A$2:$A$10003)-1,\"\"),ROWS($B$8:$B11))),\"0\"))","v":""},{"$f":"IF(B11=\"\",\"\",SUM(C11:H11))","v":""}]
[null,{"$f":"IFERROR(INDEX('manual inputs'!M:M,SMALL(IF('manual inputs'!M:M<>\"\",ROW('manual inputs'!M:M)),ROW(7:7))),\"\")","v":""},{"$f":"IF($B12=\"\",\"\",IFERROR(INDEX('quantities report'!$D$2:$D$10003,SMALL(IF('quantities report'!$A$2:$A$10003=C$6,ROW('quantities report'!$A$2:$A$10003)-1,\"\"),ROWS($B$8:$B12))),\"0\"))","v":""},{"$f":"IF($B12=\"\",\"\",IFERROR(INDEX('quantities report'!$D$2:$D$10003,SMALL(IF('quantities report'!$A$2:$A$10003=D$6,ROW('quantities report'!$A$2:$A$10003)-1,\"\"),ROWS($B$8:$B12))),\"0\"))","v":""},{"$f":"IF($B12=\"\",\"\",IFERROR(INDEX('quantities report'!$D$2:$D$10003,SMALL(IF('quantities report'!$A$2:$A$10003=E$6,ROW('quantities report'!$A$2:$A$10003)-1,\"\"),ROWS($B$8:$B12))),\"0\"))","v":""},{"$f":"IF($B12=\"\",\"\",IFERROR(INDEX('quantities report'!$D$2:$D$10003,SMALL(IF('quantities report'!$A$2:$A$10003=F$6,ROW('quantities report'!$A$2:$A$10003)-1,\"\"),ROWS($B$8:$B12))),\"0\"))","v":""},{"$f":"IF($B12=\"\",\"\",IFERROR(INDEX('quantities report'!$D$2:$D$10003,SMALL(IF('quantities report'!$A$2:$A$10003=G$6,ROW('quantities report'!$A$2:$A$10003)-1,\"\"),ROWS($B$8:$B12))),\"0\"))","v":""},{"$f":"IF($B12=\"\",\"\",IFERROR(INDEX('quantities report'!$D$2:$D$10003,SMALL(IF('quantities report'!$A$2:$A$10003=H$6,ROW('quantities report'!$A$2:$A$10003)-1,\"\"),ROWS($B$8:$B12))),\"0\"))","v":""},{"$f":"IF(B12=\"\",\"\",SUM(C12:H12))","v":""}]
[null,{"$f":"IFERROR(INDEX('manual inputs'!M:M,SMALL(IF('manual inputs'!M:M<>\"\",ROW('manual inputs'!M:M)),ROW(8:8))),\"\")","v":""},{"$f":"IF($B13=\"\",\"\",IFERROR(INDEX('quantities report'!$D$2:$D$10003,SMALL(IF('quantities report'!$A$2:$A$10003=C$6,ROW('quantities report'!$A$2:$A$10003)-1,\"\"),ROWS($B$8:$B13))),\"0\"))","v":""},{"$f":"IF($B13=\"\",\"\",IFERROR(INDEX('quantities report'!$D$2:$D$10003,SMALL(IF('quantities report'!$A$2:$A$10003=D$6,ROW('quantities report'!$A$2:$A$10003)-1,\"\"),ROWS($B$8:$B13))),\"0\"))","v":""},{"$f":"IF($B13=\"\",\"\",IFERROR(INDEX('quantities report'!$D$2:$D$10003,SMALL(IF('quantities report'!$A$2:$A$10003=E$6,ROW('quantities report'!$A$2:$A$10003)-1,\"\"),ROWS($B$8:$B13))),\"0\"))","v":""},{"$f":"IF($B13=\"\",\"\",IFERROR(INDEX('quantities report'!$D$2:$D$10003,SMALL(IF('quantities report'!$A$2:$A$10003=F$6,ROW('quantities report'!$A$2:$A$10003)-1,\"\"),ROWS($B$8:$B13))),\"0\"))","v":""},{"$f":"IF($B13=\"\",\"\",IFERROR(INDEX('quantities report'!$D$2:$D$10003,SMALL(IF('quantities report'!$A$2:$A$10003=G$6,ROW('quantities report'!$A$2:$A$10003)-1,\"\"),ROWS($B$8:$B13))),\"0\"))","v":""},{"$f":"IF($B13=\"\",\"\",IFERROR(INDEX('quantities report'!$D$2:$D$10003,SMALL(IF('quantities report'!$A$2:$A$10003=H$6,ROW('quantities report'!$A$2:$A$10003)-1,\"\"),ROWS($B$8:$B13))),\"0\"))","v":""},{"$f":"IF(B13=\"\",\"\",SUM(C13:H13))","v":""}]
[null,{"$f":"IFERROR(INDEX('manual inputs'!M:M,SMALL(IF('manual inputs'!M:M<>\"\",ROW('manual inputs'!M:M)),ROW(9:9))),\"\")","v":""},{"$f":"IF($B14=\"\",\"\",IFERROR(INDEX('quantities report'!$D$2:$D$10003,SMALL(IF('quantities report'!$A$2:$A$10003=C$6,ROW('quantities report'!$A$2:$A$10003)-1,\"\"),ROWS($B$8:$B14))),\"0\"))","v":""},{"$f":"IF($B14=\"\",\"\",IFERROR(INDEX('quantities report'!$D$2:$D$10003,SMALL(IF('quantities report'!$A$2:$A$10003=D$6,ROW('quantities report'!$A$2:$A$10003)-1,\"\"),ROWS($B$8:$B14))),\"0\"))","v":""},{"$f":"IF($B14=\"\",\"\",IFERROR(INDEX('quantities report'!$D$2:$D$10003,SMALL(IF('quantities report'!$A$2:$A$10003=E$6,ROW('quantities report'!$A$2:$A$10003)-1,\"\"),ROWS($B$8:$B14))),\"0\"))","v":""},{"$f":"IF($B14=\"\",\"\",IFERROR(INDEX('quantities report'!$D$2:$D$10003,SMALL(IF('quantities report'!$A$2:$A$10003=F$6,ROW('quantities report'!$A$2:$A$10003)-1,\"\"),ROWS($B$8:$B14))),\"0\"))","v":""},{"$f":"IF($B14=\"\",\"\",IFERROR(INDEX('quantities report'!$D$2:$D$10003,SMALL(IF('quantities report'!$A$2:$A$10003=G$6,ROW('quantities report'!$A$2:$A$10003)-1,\"\"),ROWS($B$8:$B14))),\"0\"))","v":""},{"$f":"IF($B14=\"\",\"\",IFERROR(INDEX('quantities report'!$D$2:$D$10003,SMALL(IF('quantities report'!$A$2:$A$10003=H$6,ROW('quantities report'!$A$2:$A$10003)-1,\"\"),ROWS($B$8:$B14))),\"0\"))","v":""},{"$f":"IF(B14=\"\",\"\",SUM(C14:H14))","v":""}]
[null,{"$f":"IFERROR(INDEX('manual inputs'!M:M,SMALL(IF('manual inputs'!M:M<>\"\",ROW('manual inputs'!M:M)),ROW(10:10))),\"\")","v":""},{"$f":"IF($B15=\"\",\"\",IFERROR(INDEX('quantities report'!$D$2:$D$10003,SMALL(IF('quantities report'!$A$2:$A$10003=C$6,ROW('quantities report'!$A$2:$A$10003)-1,\"\"),ROWS($B$8:$B15))),\"0\"))","v":""},{"$f":"IF($B15=\"\",\"\",IFERROR(INDEX('quantities report'!$D$2:$D$10003,SMALL(IF('quantities report'!$A$2:$A$10003=D$6,ROW('quantities report'!$A$2:$A$10003)-1,\"\"),ROWS($B$8:$B15))),\"0\"))","v":""},{"$f":"IF($B15=\"\",\"\",IFERROR(INDEX('quantities report'!$D$2:$D$10003,SMALL(IF('quantities report'!$A$2:$A$10003=E$6,ROW('quantities report'!$A$2:$A$10003)-1,\"\"),ROWS($B$8:$B15))),\"0\"))","v":""},{"$f":"IF($B15=\"\",\"\",IFERROR(INDEX('quantities report'!$D$2:$D$10003,SMALL(IF('quantities report'!$A$2:$A$10003=F$6,ROW('quantities report'!$A$2:$A$10003)-1,\"\"),ROWS($B$8:$B15))),\"0\"))","v":""},{"$f":"IF($B15=\"\",\"\",IFERROR(INDEX('quantities report'!$D$2:$D$10003,SMALL(IF('quantities report'!$A$2:$A$10003=G$6,ROW('quantities report'!$A$2:$A$10003)-1,\"\"),ROWS($B$8:$B15))),\"0\"))","v":""},{"$f":"IF($B15=\"\",\"\",IFERROR(INDEX('quantities report'!$D$2:$D$10003,SMALL(IF('quantities report'!$A$2:$A$10003=H$6,ROW('quantities report'!$A$2:$A$10003)-1,\"\"),ROWS($B$8:$B15))),\"0\"))","v":""},{"$f":"IF(B15=\"\",\"\",SUM(C15:H15))","v":""}]
[null,{"$f":"IFERROR(INDEX('manual inputs'!M:M,SMALL(IF('manual inputs'!M:M<>\"\",ROW('manual inputs'!M:M)),ROW(11:11))),\"\")","v":""},{"$f":"IF($B16=\"\",\"\",IFERROR(INDEX('quantities report'!$D$2:$D$10003,SMALL(IF('quantities report'!$A$2:$A$10003=C$6,ROW('quantities report'!$A$2:$A$10003)-1,\"\"),ROWS($B$8:$B16))),\"0\"))","v":""},{"$f":"IF($B16=\"\",\"\",IFERROR(INDEX('quantities report'!$D$2:$D$10003,SMALL(IF('quantities report'!$A$2:$A$10003=D$6,ROW('quantities report'!$A$2:$A$10003)-1,\"\"),ROWS($B$8:$B16))),\"0\"))","v":""},{"$f":"IF($B16=\"\",\"\",IFERROR(INDEX('quantities report'!$D$2:$D$10003,SMALL(IF('quantities report'!$A$2:$A$10003=E$6,ROW('quantities report'!$A$2:$A$10003)-1,\"\"),ROWS($B$8:$B16))),\"0\"))","v":""},{"$f":"IF($B16=\"\",\"\",IFERROR(INDEX('quantities report'!$D$2:$D$10003,SMALL(IF('quantities report'!$A$2:$A$10003=F$6,ROW('quantities report'!$A$2:$A$10003)-1,\"\"),ROWS($B$8:$B16))),\"0\"))","v":""},{"$f":"IF($B16=\"\",\"\",IFERROR(INDEX('quantities report'!$D$2:$D$10003,SMALL(IF('quantities report'!$A$2:$A$10003=G$6,ROW('quantities report'!$A$2:$A$10003)-1,\"\"),ROWS($B$8:$B16))),\"0\"))","v":""},{"$f":"IF($B16=\"\",\"\",IFERROR(INDEX('quantities report'!$D$2:$D$10003,SMALL(IF('quantities report'!$A$2:$A$10003=H$6,ROW('quantities report'!$A$2:$A$10003)-1,\"\"),ROWS($B$8:$B16))),\"0\"))","v":""},{"$f":"IF(B16=\"\",\"\",SUM(C16:H16))","v":""}]
[null,{"$f":"IFERROR(INDEX('manual inputs'!M:M,SMALL(IF('manual inputs'!M:M<>\"\",ROW('manual inputs'!M:M)),ROW(12:12))),\"\")","v":""},{"$f":"IF($B17=\"\",\"\",IFERROR(INDEX('quantities report'!$D$2:$D$10003,SMALL(IF('quantities report'!$A$2:$A$10003=C$6,ROW('quantities report'!$A$2:$A$10003)-1,\"\"),ROWS($B$8:$B17))),\"0\"))","v":""},{"$f":"IF($B17=\"\",\"\",IFERROR(INDEX('quantities report'!$D$2:$D$10003,SMALL(IF('quantities report'!$A$2:$A$10003=D$6,ROW('quantities report'!$A$2:$A$10003)-1,\"\"),ROWS($B$8:$B17))),\"0\"))","v":""},{"$f":"IF($B17=\"\",\"\",IFERROR(INDEX('quantities report'!$D$2:$D$10003,SMALL(IF('quantities report'!$A$2:$A$10003=E$6,ROW('quantities report'!$A$2:$A$10003)-1,\"\"),ROWS($B$8:$B17))),\"0\"))","v":""},{"$f":"IF($B17=\"\",\"\",IFERROR(INDEX('quantities report'!$D$2:$D$10003,SMALL(IF('quantities report'!$A$2:$A$10003=F$6,ROW('quantities report'!$A$2:$A$10003)-1,\"\"),ROWS($B$8:$B17))),\"0\"))","v":""},{"$f":"IF($B17=\"\",\"\",IFERROR(INDEX('quantities report'!$D$2:$D$10003,SMALL(IF('quantities report'!$A$2:$A$10003=G$6,ROW('quantities report'!$A$2:$A$10003)-1,\"\"),ROWS($B$8:$B17))),\"0\"))","v":""},{"$f":"IF($B17=\"\",\"\",IFERROR(INDEX('quantities report'!$D$2:$D$10003,SMALL(IF('quantities report'!$A$2:$A$10003=H$6,ROW('quantities report'!$A$2:$A$10003)-1,\"\"),ROWS($B$8:$B17))),\"0\"))","v":""},{"$f":"IF(B17=\"\",\"\",SUM(C17:H17))","v":""}]
[null,{"$f":"IFERROR(INDEX('manual inputs'!M:M,SMALL(IF('manual inputs'!M:M<>\"\",ROW('manual inputs'!M:M)),ROW(13:13))),\"\")","v":""},{"$f":"IF($B18=\"\",\"\",IFERROR(INDEX('quantities report'!$D$2:$D$10003,SMALL(IF('quantities report'!$A$2:$A$10003=C$6,ROW('quantities report'!$A$2:$A$10003)-1,\"\"),ROWS($B$8:$B18))),\"0\"))","v":""},{"$f":"IF($B18=\"\",\"\",IFERROR(INDEX('quantities report'!$D$2:$D$10003,SMALL(IF('quantities report'!$A$2:$A$10003=D$6,ROW('quantities report'!$A$2:$A$10003)-1,\"\"),ROWS($B$8:$B18))),\"0\"))","v":""},{"$f":"IF($B18=\"\",\"\",IFERROR(INDEX('quantities report'!$D$2:$D$10003,SMALL(IF('quantities report'!$A$2:$A$10003=E$6,ROW('quantities report'!$A$2:$A$10003)-1,\"\"),ROWS($B$8:$B18))),\"0\"))","v":""},{"$f":"IF($B18=\"\",\"\",IFERROR(INDEX('quantities report'!$D$2:$D$10003,SMALL(IF('quantities report'!$A$2:$A$10003=F$6,ROW('quantities report'!$A$2:$A$10003)-1,\"\"),ROWS($B$8:$B18))),\"0\"))","v":""},{"$f":"IF($B18=\"\",\"\",IFERROR(INDEX('quantities report'!$D$2:$D$10003,SMALL(IF('quantities report'!$A$2:$A$10003=G$6,ROW('quantities report'!$A$2:$A$10003)-1,\"\"),ROWS($B$8:$B18))),\"0\"))","v":""},{"$f":"IF($B18=\"\",\"\",IFERROR(INDEX('quantities report'!$D$2:$D$10003,SMALL(IF('quantities report'!$A$2:$A$10003=H$6,ROW('quantities report'!$A$2:$A$10003)-1,\"\"),ROWS($B$8:$B18))),\"0\"))","v":""},{"$f":"IF(B18=\"\",\"\",SUM(C18:H18))","v":""}]
[null,{"$f":"IFERROR(INDEX('manual inputs'!M:M,SMALL(IF('manual inputs'!M:M<>\"\",ROW('manual inputs'!M:M)),ROW(14:14))),\"\")","v":""},{"$f":"IF($B19=\"\",\"\",IFERROR(INDEX('quantities report'!$D$2:$D$10003,SMALL(IF('quantities report'!$A$2:$A$10003=C$6,ROW('quantities report'!$A$2:$A$10003)-1,\"\"),ROWS($B$8:$B19))),\"0\"))","v":""},{"$f":"IF($B19=\"\",\"\",IFERROR(INDEX('quantities report'!$D$2:$D$10003,SMALL(IF('quantities report'!$A$2:$A$10003=D$6,ROW('quantities report'!$A$2:$A$10003)-1,\"\"),ROWS($B$8:$B19))),\"0\"))","v":""},{"$f":"IF($B19=\"\",\"\",IFERROR(INDEX('quantities report'!$D$2:$D$10003,SMALL(IF('quantities report'!$A$2:$A$10003=E$6,ROW('quantities report'!$A$2:$A$10003)-1,\"\"),ROWS($B$8:$B19))),\"0\"))","v":""},{"$f":"IF($B19=\"\",\"\",IFERROR(INDEX('quantities report'!$D$2:$D$10003,SMALL(IF('quantities report'!$A$2:$A$10003=F$6,ROW('quantities report'!$A$2:$A$10003)-1,\"\"),ROWS($B$8:$B19))),\"0\"))","v":""},{"$f":"IF($B19=\"\",\"\",IFERROR(INDEX('quantities report'!$D$2:$D$10003,SMALL(IF('quantities report'!$A$2:$A$10003=G$6,ROW('quantities report'!$A$2:$A$10003)-1,\"\"),ROWS($B$8:$B19))),\"0\"))","v":""},{"$f":"IF($B19=\"\",\"\",IFERROR(INDEX('quantities report'!$D$2:$D$10003,SMALL(IF('quantities report'!$A$2:$A$10003=H$6,ROW('quantities report'!$A$2:$A$10003)-1,\"\"),ROWS($B$8:$B19))),\"0\"))","v":""},{"$f":"IF(B19=\"\",\"\",SUM(C19:H19))","v":""}]
[null,{"$f":"IFERROR(INDEX('manual inputs'!M:M,SMALL(IF('manual inputs'!M:M<>\"\",ROW('manual inputs'!M:M)),ROW(15:15))),\"\")","v":""},{"$f":"IF($B20=\"\",\"\",IFERROR(INDEX('quantities report'!$D$2:$D$10003,SMALL(IF('quantities report'!$A$2:$A$10003=C$6,ROW('quantities report'!$A$2:$A$10003)-1,\"\"),ROWS($B$8:$B20))),\"0\"))","v":""},{"$f":"IF($B20=\"\",\"\",IFERROR(INDEX('quantities report'!$D$2:$D$10003,SMALL(IF('quantities report'!$A$2:$A$10003=D$6,ROW('quantities report'!$A$2:$A$10003)-1,\"\"),ROWS($B$8:$B20))),\"0\"))","v":""},{"$f":"IF($B20=\"\",\"\",IFERROR(INDEX('quantities report'!$D$2:$D$10003,SMALL(IF('quantities report'!$A$2:$A$10003=E$6,ROW('quantities report'!$A$2:$A$10003)-1,\"\"),ROWS($B$8:$B20))),\"0\"))","v":""},{"$f":"IF($B20=\"\",\"\",IFERROR(INDEX('quantities report'!$D$2:$D$10003,SMALL(IF('quantities report'!$A$2:$A$10003=F$6,ROW('quantities report'!$A$2:$A$10003)-1,\"\"),ROWS($B$8:$B20))),\"0\"))","v":""},{"$f":"IF($B20=\"\",\"\",IFERROR(INDEX('quantities report'!$D$2:$D$10003,SMALL(IF('quantities report'!$A$2:$A$10003=G$6,ROW('quantities report'!$A$2:$A$10003)-1,\"\"),ROWS($B$8:$B20))),\"0\"))","v":""},{"$f":"IF($B20=\"\",\"\",IFERROR(INDEX('quantities report'!$D$2:$D$10003,SMALL(IF('quantities report'!$A$2:$A$10003=H$6,ROW('quantities report'!$A$2:$A$10003)-1,\"\"),ROWS($B$8:$B20))),\"0\"))","v":""},{"$f":"IF(B20=\"\",\"\",SUM(C20:H20))","v":""}]
[null,{"$f":"IFERROR(INDEX('manual inputs'!M:M,SMALL(IF('manual inputs'!M:M<>\"\",ROW('manual inputs'!M:M)),ROW(16:16))),\"\")","v":""},{"$f":"IF($B21=\"\",\"\",IFERROR(INDEX('quantities report'!$D$2:$D$10003,SMALL(IF('quantities report'!$A$2:$A$10003=C$6,ROW('quantities report'!$A$2:$A$10003)-1,\"\"),ROWS($B$8:$B21))),\"0\"))","v":""},{"$f":"IF($B21=\"\",\"\",IFERROR(INDEX('quantities report'!$D$2:$D$10003,SMALL(IF('quantities report'!$A$2:$A$10003=D$6,ROW('quantities report'!$A$2:$A$10003)-1,\"\"),ROWS($B$8:$B21))),\"0\"))","v":""},{"$f":"IF($B21=\"\",\"\",IFERROR(INDEX('quantities report'!$D$2:$D$10003,SMALL(IF('quantities report'!$A$2:$A$10003=E$6,ROW('quantities report'!$A$2:$A$10003)-1,\"\"),ROWS($B$8:$B21))),\"0\"))","v":""},{"$f":"IF($B21=\"\",\"\",IFERROR(INDEX('quantities report'!$D$2:$D$10003,SMALL(IF('quantities report'!$A$2:$A$10003=F$6,ROW('quantities report'!$A$2:$A$10003)-1,\"\"),ROWS($B$8:$B21))),\"0\"))","v":""},{"$f":"IF($B21=\"\",\"\",IFERROR(INDEX('quantities report'!$D$2:$D$10003,SMALL(IF('quantities report'!$A$2:$A$10003=G$6,ROW('quantities report'!$A$2:$A$10003)-1,\"\"),ROWS($B$8:$B21))),\"0\"))","v":""},{"$f":"IF($B21=\"\",\"\",IFERROR(INDEX('quantities report'!$D$2:$D$10003,SMALL(IF('quantities report'!$A$2:$A$10003=H$6,ROW('quantities report'!$A$2:$A$10003)-1,\"\"),ROWS($B$8:$B21))),\"0\"))","v":""},{"$f":"IF(B21=\"\",\"\",SUM(C21:H21))","v":""}]
[null,{"$f":"IFERROR(INDEX('manual inputs'!M:M,SMALL(IF('manual inputs'!M:M<>\"\",ROW('manual inputs'!M:M)),ROW(17:17))),\"\")","v":""},{"$f":"IF($B22=\"\",\"\",IFERROR(INDEX('quantities report'!$D$2:$D$10003,SMALL(IF('quantities report'!$A$2:$A$10003=C$6,ROW('quantities report'!$A$2:$A$10003)-1,\"\"),ROWS($B$8:$B22))),\"0\"))","v":""},{"$f":"IF($B22=\"\",\"\",IFERROR(INDEX('quantities report'!$D$2:$D$10003,SMALL(IF('quantities report'!$A$2:$A$10003=D$6,ROW('quantities report'!$A$2:$A$10003)-1,\"\"),ROWS($B$8:$B22))),\"0\"))","v":""},{"$f":"IF($B22=\"\",\"\",IFERROR(INDEX('quantities report'!$D$2:$D$10003,SMALL(IF('quantities report'!$A$2:$A$10003=E$6,ROW('quantities report'!$A$2:$A$10003)-1,\"\"),ROWS($B$8:$B22))),\"0\"))","v":""},{"$f":"IF($B22=\"\",\"\",IFERROR(INDEX('quantities report'!$D$2:$D$10003,SMALL(IF('quantities report'!$A$2:$A$10003=F$6,ROW('quantities report'!$A$2:$A$10003)-1,\"\"),ROWS($B$8:$B22))),\"0\"))","v":""},{"$f":"IF($B22=\"\",\"\",IFERROR(INDEX('quantities report'!$D$2:$D$10003,SMALL(IF('quantities report'!$A$2:$A$10003=G$6,ROW('quantities report'!$A$2:$A$10003)-1,\"\"),ROWS($B$8:$B22))),\"0\"))","v":""},{"$f":"IF($B22=\"\",\"\",IFERROR(INDEX('quantities report'!$D$2:$D$10003,SMALL(IF('quantities report'!$A$2:$A$10003=H$6,ROW('quantities report'!$A$2:$A$10003)-1,\"\"),ROWS($B$8:$B22))),\"0\"))","v":""},{"$f":"IF(B22=\"\",\"\",SUM(C22:H22))","v":""}]
[null,{"$f":"IFERROR(INDEX('manual inputs'!M:M,SMALL(IF('manual inputs'!M:M<>\"\",ROW('manual inputs'!M:M)),ROW(18:18))),\"\")","v":""},{"$f":"IF($B23=\"\",\"\",IFERROR(INDEX('quantities report'!$D$2:$D$10003,SMALL(IF('quantities report'!$A$2:$A$10003=C$6,ROW('quantities report'!$A$2:$A$10003)-1,\"\"),ROWS($B$8:$B23))),\"0\"))","v":""},{"$f":"IF($B23=\"\",\"\",IFERROR(INDEX('quantities report'!$D$2:$D$10003,SMALL(IF('quantities report'!$A$2:$A$10003=D$6,ROW('quantities report'!$A$2:$A$10003)-1,\"\"),ROWS($B$8:$B23))),\"0\"))","v":""},{"$f":"IF($B23=\"\",\"\",IFERROR(INDEX('quantities report'!$D$2:$D$10003,SMALL(IF('quantities report'!$A$2:$A$10003=E$6,ROW('quantities report'!$A$2:$A$10003)-1,\"\"),ROWS($B$8:$B23))),\"0\"))","v":""},{"$f":"IF($B23=\"\",\"\",IFERROR(INDEX('quantities report'!$D$2:$D$10003,SMALL(IF('quantities report'!$A$2:$A$10003=F$6,ROW('quantities report'!$A$2:$A$10003)-1,\"\"),ROWS($B$8:$B23))),\"0\"))","v":""},{"$f":"IF($B23=\"\",\"\",IFERROR(INDEX('quantities report'!$D$2:$D$10003,SMALL(IF('quantities report'!$A$2:$A$10003=G$6,ROW('quantities report'!$A$2:$A$10003)-1,\"\"),ROWS($B$8:$B23))),\"0\"))","v":""},{"$f":"IF($B23=\"\",\"\",IFERROR(INDEX('quantities report'!$D$2:$D$10003,SMALL(IF('quantities report'!$A$2:$A$10003=H$6,ROW('quantities report'!$A$2:$A$10003)-1,\"\"),ROWS($B$8:$B23))),\"0\"))","v":""},{"$f":"IF(B23=\"\",\"\",SUM(C23:H23))","v":""}]
[null,{"$f":"IFERROR(INDEX('manual inputs'!M:M,SMALL(IF('manual inputs'!M:M<>\"\",ROW('manual inputs'!M:M)),ROW(19:19))),\"\")","v":""},{"$f":"IF($B24=\"\",\"\",IFERROR(INDEX('quantities report'!$D$2:$D$10003,SMALL(IF('quantities report'!$A$2:$A$10003=C$6,ROW('quantities report'!$A$2:$A$10003)-1,\"\"),ROWS($B$8:$B24))),\"0\"))","v":""},{"$f":"IF($B24=\"\",\"\",IFERROR(INDEX('quantities report'!$D$2:$D$10003,SMALL(IF('quantities report'!$A$2:$A$10003=D$6,ROW('quantities report'!$A$2:$A$10003)-1,\"\"),ROWS($B$8:$B24))),\"0\"))","v":""},{"$f":"IF($B24=\"\",\"\",IFERROR(INDEX('quantities report'!$D$2:$D$10003,SMALL(IF('quantities report'!$A$2:$A$10003=E$6,ROW('quantities report'!$A$2:$A$10003)-1,\"\"),ROWS($B$8:$B24))),\"0\"))","v":""},{"$f":"IF($B24=\"\",\"\",IFERROR(INDEX('quantities report'!$D$2:$D$10003,SMALL(IF('quantities report'!$A$2:$A$10003=F$6,ROW('quantities report'!$A$2:$A$10003)-1,\"\"),ROWS($B$8:$B24))),\"0\"))","v":""},{"$f":"IF($B24=\"\",\"\",IFERROR(INDEX('quantities report'!$D$2:$D$10003,SMALL(IF('quantities report'!$A$2:$A$10003=G$6,ROW('quantities report'!$A$2:$A$10003)-1,\"\"),ROWS($B$8:$B24))),\"0\"))","v":""},{"$f":"IF($B24=\"\",\"\",IFERROR(INDEX('quantities report'!$D$2:$D$10003,SMALL(IF('quantities report'!$A$2:$A$10003=H$6,ROW('quantities report'!$A$2:$A$10003)-1,\"\"),ROWS($B$8:$B24))),\"0\"))","v":""},{"$f":"IF(B24=\"\",\"\",SUM(C24:H24))","v":""}]
[null,{"$f":"IFERROR(INDEX('manual inputs'!M:M,SMALL(IF('manual inputs'!M:M<>\"\",ROW('manual inputs'!M:M)),ROW(20:20))),\"\")","v":""},{"$f":"IF($B25=\"\",\"\",IFERROR(INDEX('quantities report'!$D$2:$D$10003,SMALL(IF('quantities report'!$A$2:$A$10003=C$6,ROW('quantities report'!$A$2:$A$10003)-1,\"\"),ROWS($B$8:$B25))),\"0\"))","v":""},{"$f":"IF($B25=\"\",\"\",IFERROR(INDEX('quantities report'!$D$2:$D$10003,SMALL(IF('quantities report'!$A$2:$A$10003=D$6,ROW('quantities report'!$A$2:$A$10003)-1,\"\"),ROWS($B$8:$B25))),\"0\"))","v":""},{"$f":"IF($B25=\"\",\"\",IFERROR(INDEX('quantities report'!$D$2:$D$10003,SMALL(IF('quantities report'!$A$2:$A$10003=E$6,ROW('quantities report'!$A$2:$A$10003)-1,\"\"),ROWS($B$8:$B25))),\"0\"))","v":""},{"$f":"IF($B25=\"\",\"\",IFERROR(INDEX('quantities report'!$D$2:$D$10003,SMALL(IF('quantities report'!$A$2:$A$10003=F$6,ROW('quantities report'!$A$2:$A$10003)-1,\"\"),ROWS($B$8:$B25))),\"0\"))","v":""},{"$f":"IF($B25=\"\",\"\",IFERROR(INDEX('quantities report'!$D$2:$D$10003,SMALL(IF('quantities report'!$A$2:$A$10003=G$6,ROW('quantities report'!$A$2:$A$10003)-1,\"\"),ROWS($B$8:$B25))),\"0\"))","v":""},{"$f":"IF($B25=\"\",\"\",IFERROR(INDEX('quantities report'!$D$2:$D$10003,SMALL(IF('quantities report'!$A$2:$A$10003=H$6,ROW('quantities report'!$A$2:$A$10003)-1,\"\"),ROWS($B$8:$B25))),\"0\"))","v":""},{"$f":"IF(B25=\"\",\"\",SUM(C25:H25))","v":""}]
[null,{"$f":"IFERROR(INDEX('manual inputs'!M:M,SMALL(IF('manual inputs'!M:M<>\"\",ROW('manual inputs'!M:M)),ROW(21:21))),\"\")","v":""},{"$f":"IF($B26=\"\",\"\",IFERROR(INDEX('quantities report'!$D$2:$D$10003,SMALL(IF('quantities report'!$A$2:$A$10003=C$6,ROW('quantities report'!$A$2:$A$10003)-1,\"\"),ROWS($B$8:$B26))),\"0\"))","v":""},{"$f":"IF($B26=\"\",\"\",IFERROR(INDEX('quantities report'!$D$2:$D$10003,SMALL(IF('quantities report'!$A$2:$A$10003=D$6,ROW('quantities report'!$A$2:$A$10003)-1,\"\"),ROWS($B$8:$B26))),\"0\"))","v":""},{"$f":"IF($B26=\"\",\"\",IFERROR(INDEX('quantities report'!$D$2:$D$10003,SMALL(IF('quantities report'!$A$2:$A$10003=E$6,ROW('quantities report'!$A$2:$A$10003)-1,\"\"),ROWS($B$8:$B26))),\"0\"))","v":""},{"$f":"IF($B26=\"\",\"\",IFERROR(INDEX('quantities report'!$D$2:$D$10003,SMALL(IF('quantities report'!$A$2:$A$10003=F$6,ROW('quantities report'!$A$2:$A$10003)-1,\"\"),ROWS($B$8:$B26))),\"0\"))","v":""},{"$f":"IF($B26=\"\",\"\",IFERROR(INDEX('quantities report'!$D$2:$D$10003,SMALL(IF('quantities report'!$A$2:$A$10003=G$6,ROW('quantities report'!$A$2:$A$10003)-1,\"\"),ROWS($B$8:$B26))),\"0\"))","v":""},{"$f":"IF($B26=\"\",\"\",IFERROR(INDEX('quantities report'!$D$2:$D$10003,SMALL(IF('quantities report'!$A$2:$A$10003=H$6,ROW('quantities report'!$A$2:$A$10003)-1,\"\"),ROWS($B$8:$B26))),\"0\"))","v":""},{"$f":"IF(B26=\"\",\"\",SUM(C26:H26))","v":""}]
[null,{"$f":"IFERROR(INDEX('manual inputs'!M:M,SMALL(IF('manual inputs'!M:M<>\"\",ROW('manual inputs'!M:M)),ROW(22:22))),\"\")","v":""},{"$f":"IF($B27=\"\",\"\",IFERROR(INDEX('quantities report'!$D$2:$D$10003,SMALL(IF('quantities report'!$A$2:$A$10003=C$6,ROW('quantities report'!$A$2:$A$10003)-1,\"\"),ROWS($B$8:$B27))),\"0\"))","v":""},{"$f":"IF($B27=\"\",\"\",IFERROR(INDEX('quantities report'!$D$2:$D$10003,SMALL(IF('quantities report'!$A$2:$A$10003=D$6,ROW('quantities report'!$A$2:$A$10003)-1,\"\"),ROWS($B$8:$B27))),\"0\"))","v":""},{"$f":"IF($B27=\"\",\"\",IFERROR(INDEX('quantities report'!$D$2:$D$10003,SMALL(IF('quantities report'!$A$2:$A$10003=E$6,ROW('quantities report'!$A$2:$A$10003)-1,\"\"),ROWS($B$8:$B27))),\"0\"))","v":""},{"$f":"IF($B27=\"\",\"\",IFERROR(INDEX('quantities report'!$D$2:$D$10003,SMALL(IF('quantities report'!$A$2:$A$10003=F$6,ROW('quantities report'!$A$2:$A$10003)-1,\"\"),ROWS($B$8:$B27))),\"0\"))","v":""},{"$f":"IF($B27=\"\",\"\",IFERROR(INDEX('quantities report'!$D$2:$D$10003,SMALL(IF('quantities report'!$A$2:$A$10003=G$6,ROW('quantities report'!$A$2:$A$10003)-1,\"\"),ROWS($B$8:$B27))),\"0\"))","v":""},{"$f":"IF($B27=\"\",\"\",IFERROR(INDEX('quantities report'!$D$2:$D$10003,SMALL(IF('quantities report'!$A$2:$A$10003=H$6,ROW('quantities report'!$A$2:$A$10003)-1,\"\"),ROWS($B$8:$B27))),\"0\"))","v":""},{"$f":"IF(B27=\"\",\"\",SUM(C27:H27))","v":""}]
[null,{"$f":"IFERROR(INDEX('manual inputs'!M:M,SMALL(IF('manual inputs'!M:M<>\"\",ROW('manual inputs'!M:M)),ROW(23:23))),\"\")","v":""},{"$f":"IF($B28=\"\",\"\",IFERROR(INDEX('quantities report'!$D$2:$D$10003,SMALL(IF('quantities report'!$A$2:$A$10003=C$6,ROW('quantities report'!$A$2:$A$10003)-1,\"\"),ROWS($B$8:$B28))),\"0\"))","v":""},{"$f":"IF($B28=\"\",\"\",IFERROR(INDEX('quantities report'!$D$2:$D$10003,SMALL(IF('quantities report'!$A$2:$A$10003=D$6,ROW('quantities report'!$A$2:$A$10003)-1,\"\"),ROWS($B$8:$B28))),\"0\"))","v":""},{"$f":"IF($B28=\"\",\"\",IFERROR(INDEX('quantities report'!$D$2:$D$10003,SMALL(IF('quantities report'!$A$2:$A$10003=E$6,ROW('quantities report'!$A$2:$A$10003)-1,\"\"),ROWS($B$8:$B28))),\"0\"))","v":""},{"$f":"IF($B28=\"\",\"\",IFERROR(INDEX('quantities report'!$D$2:$D$10003,SMALL(IF('quantities report'!$A$2:$A$10003=F$6,ROW('quantities report'!$A$2:$A$10003)-1,\"\"),ROWS($B$8:$B28))),\"0\"))","v":""},{"$f":"IF($B28=\"\",\"\",IFERROR(INDEX('quantities report'!$D$2:$D$10003,SMALL(IF('quantities report'!$A$2:$A$10003=G$6,ROW('quantities report'!$A$2:$A$10003)-1,\"\"),ROWS($B$8:$B28))),\"0\"))","v":""},{"$f":"IF($B28=\"\",\"\",IFERROR(INDEX('quantities report'!$D$2:$D$10003,SMALL(IF('quantities report'!$A$2:$A$10003=H$6,ROW('quantities report'!$A$2:$A$10003)-1,\"\"),ROWS($B$8:$B28))),\"0\"))","v":""},{"$f":"IF(B28=\"\",\"\",SUM(C28:H28))","v":""}]
[null,{"$f":"IFERROR(INDEX('manual inputs'!M:M,SMALL(IF('manual inputs'!M:M<>\"\",ROW('manual inputs'!M:M)),ROW(24:24))),\"\")","v":""},{"$f":"IF($B29=\"\",\"\",IFERROR(INDEX('quantities report'!$D$2:$D$10003,SMALL(IF('quantities report'!$A$2:$A$10003=C$6,ROW('quantities report'!$A$2:$A$10003)-1,\"\"),ROWS($B$8:$B29))),\"0\"))","v":""},{"$f":"IF($B29=\"\",\"\",IFERROR(INDEX('quantities report'!$D$2:$D$10003,SMALL(IF('quantities report'!$A$2:$A$10003=D$6,ROW('quantities report'!$A$2:$A$10003)-1,\"\"),ROWS($B$8:$B29))),\"0\"))","v":""},{"$f":"IF($B29=\"\",\"\",IFERROR(INDEX('quantities report'!$D$2:$D$10003,SMALL(IF('quantities report'!$A$2:$A$10003=E$6,ROW('quantities report'!$A$2:$A$10003)-1,\"\"),ROWS($B$8:$B29))),\"0\"))","v":""},{"$f":"IF($B29=\"\",\"\",IFERROR(INDEX('quantities report'!$D$2:$D$10003,SMALL(IF('quantities report'!$A$2:$A$10003=F$6,ROW('quantities report'!$A$2:$A$10003)-1,\"\"),ROWS($B$8:$B29))),\"0\"))","v":""},{"$f":"IF($B29=\"\",\"\",IFERROR(INDEX('quantities report'!$D$2:$D$10003,SMALL(IF('quantities report'!$A$2:$A$10003=G$6,ROW('quantities report'!$A$2:$A$10003)-1,\"\"),ROWS($B$8:$B29))),\"0\"))","v":""},{"$f":"IF($B29=\"\",\"\",IFERROR(INDEX('quantities report'!$D$2:$D$10003,SMALL(IF('quantities report'!$A$2:$A$10003=H$6,ROW('quantities report'!$A$2:$A$10003)-1,\"\"),ROWS($B$8:$B29))),\"0\"))","v":""},{"$f":"IF(B29=\"\",\"\",SUM(C29:H29))","v":""}]
[null,{"$f":"IFERROR(INDEX('manual inputs'!M:M,SMALL(IF('manual inputs'!M:M<>\"\",ROW('manual inputs'!M:M)),ROW(25:25))),\"\")","v":""},{"$f":"IF($B30=\"\",\"\",IFERROR(INDEX('quantities report'!$D$2:$D$10003,SMALL(IF('quantities report'!$A$2:$A$10003=C$6,ROW('quantities report'!$A$2:$A$10003)-1,\"\"),ROWS($B$8:$B30))),\"0\"))","v":""},{"$f":"IF($B30=\"\",\"\",IFERROR(INDEX('quantities report'!$D$2:$D$10003,SMALL(IF('quantities report'!$A$2:$A$10003=D$6,ROW('quantities report'!$A$2:$A$10003)-1,\"\"),ROWS($B$8:$B30))),\"0\"))","v":""},{"$f":"IF($B30=\"\",\"\",IFERROR(INDEX('quantities report'!$D$2:$D$10003,SMALL(IF('quantities report'!$A$2:$A$10003=E$6,ROW('quantities report'!$A$2:$A$10003)-1,\"\"),ROWS($B$8:$B30))),\"0\"))","v":""},{"$f":"IF($B30=\"\",\"\",IFERROR(INDEX('quantities report'!$D$2:$D$10003,SMALL(IF('quantities report'!$A$2:$A$10003=F$6,ROW('quantities report'!$A$2:$A$10003)-1,\"\"),ROWS($B$8:$B30))),\"0\"))","v":""},{"$f":"IF($B30=\"\",\"\",IFERROR(INDEX('quantities report'!$D$2:$D$10003,SMALL(IF('quantities report'!$A$2:$A$10003=G$6,ROW('quantities report'!$A$2:$A$10003)-1,\"\"),ROWS($B$8:$B30))),\"0\"))","v":""},{"$f":"IF($B30=\"\",\"\",IFERROR(INDEX('quantities report'!$D$2:$D$10003,SMALL(IF('quantities report'!$A$2:$A$10003=H$6,ROW('quantities report'!$A$2:$A$10003)-1,\"\"),ROWS($B$8:$B30))),\"0\"))","v":""},{"$f":"IF(B30=\"\",\"\",SUM(C30:H30))","v":""}]
[null,{"$f":"IFERROR(INDEX('manual inputs'!M:M,SMALL(IF('manual inputs'!M:M<>\"\",ROW('manual inputs'!M:M)),ROW(27:27))),\"\")","v":""},{"$f":"IF($B31=\"\",\"\",IFERROR(INDEX('quantities report'!$D$2:$D$10003,SMALL(IF('quantities report'!$A$2:$A$10003=C$6,ROW('quantities report'!$A$2:$A$10003)-1,\"\"),ROWS($B$8:$B31))),\"0\"))","v":""},{"$f":"IF($B31=\"\",\"\",IFERROR(INDEX('quantities report'!$D$2:$D$10003,SMALL(IF('quantities report'!$A$2:$A$10003=D$6,ROW('quantities report'!$A$2:$A$10003)-1,\"\"),ROWS($B$8:$B31))),\"0\"))","v":""},{"$f":"IF($B31=\"\",\"\",IFERROR(INDEX('quantities report'!$D$2:$D$10003,SMALL(IF('quantities report'!$A$2:$A$10003=E$6,ROW('quantities report'!$A$2:$A$10003)-1,\"\"),ROWS($B$8:$B31))),\"0\"))","v":""},{"$f":"IF($B31=\"\",\"\",IFERROR(INDEX('quantities report'!$D$2:$D$10003,SMALL(IF('quantities report'!$A$2:$A$10003=F$6,ROW('quantities report'!$A$2:$A$10003)-1,\"\"),ROWS($B$8:$B31))),\"0\"))","v":""},{"$f":"IF($B31=\"\",\"\",IFERROR(INDEX('quantities report'!$D$2:$D$10003,SMALL(IF('quantities report'!$A$2:$A$10003=G$6,ROW('quantities report'!$A$2:$A$10003)-1,\"\"),ROWS($B$8:$B31))),\"0\"))","v":""},{"$f":"IF($B31=\"\",\"\",IFERROR(INDEX('quantities report'!$D$2:$D$10003,SMALL(IF('quantities report'!$A$2:$A$10003=H$6,ROW('quantities report'!$A$2:$A$10003)-1,\"\"),ROWS($B$8:$B31))),\"0\"))","v":""},{"$f":"IF(B31=\"\",\"\",SUM(C31:H31))","v":""}]
[null,{"$f":"IFERROR(INDEX(#REF!,SMALL(IF(#REF!<>\"\",ROW(#REF!)),ROW(27:27))),\"\")","v":""}]

{"sheet":"Backfill","index":7,"n_rows":32,"n_cols":17,"rows_kept":32,"cut":false,"hidden":false,"merged":[[3,2,3,16],[4,4,5,4],[4,7,5,7],[4,15,5,15]]}
[]
[]
["TOTALS",null,{"$f":"SUM(C8:C32)","v":0},{"$f":"SUM(D8:D32)","v":0},null,0,{"$f":"SUM(G8:G32)","v":0},null,0,0,0,0,{"$f":"SUM(M8:M32)","v":0},0,0,null,0]
[null,null,"Various Backfill Material Generated Onsite"]
[null,null,"(+)\nWall Backfill","(+)\nWall Backfill","Total Wall Backfill (+)","(+)\nFoundation\nFill","(+)\nFoundation\nFill","Total Foundation Fill (+)","(+)\nSelect Wall\nBackfill","(+)\nRock","(+)\nGranular\nRock Backdrain","(+)\nStructural Backfill","(+)\nBackfill\nMaterial","(+)\nBackfill\nMaterial","(+)\nBackfill\nMaterial","Total Backfill Material (+)","(+)\nGranular\nBackfill"]
["ORD Component Name",null,"XS_TC_MSE Wall Backfill 1: ","Need Parapet backfill",null,"XS_TC_Wall Foundation: ","XS_TC_MSE Wall Foundation: ",null,"XS_TC_MSE Wall Backfill 2: ","XS_TC_Rockery Wall Back: ","Need Rockery Component","XS_TC_Wall Backfill: ","XS_TC_Soil Nail Wall Backfill: ","XS_TC_Wall Backfill 2: ","XS_TC_Guard Wall Backfill 1: ",null,"Need gabion faced MSE component"]
["Enter Start of Project",{"$f":"IFERROR(INDEX('manual inputs'!M:M,SMALL(IF('manual inputs'!M:M<>\"\",ROW('manual inputs'!M:M)),ROW(2:2))),\"\")","v":""}]
[null,{"$f":"IFERROR(INDEX('manual inputs'!M:M,SMALL(IF('manual inputs'!M:M<>\"\",ROW('manual inputs'!M:M)),ROW(3:3))),\"\")","v":""},{"$f":"IF($B8=\"\",\"\",IFERROR(INDEX('quantities report'!$D$2:$D$10003,SMALL(IF('quantities report'!$A$2:$A$10003=C$6,ROW('quantities report'!$A$2:$A$10003)-1,\"\"),ROWS($B$8:$B8))),\"0\"))","v":""},{"$f":"IF($B8=\"\",\"\",IFERROR(INDEX('quantities report'!$D$2:$D$10003,SMALL(IF('quantities report'!$A$2:$A$10003=D$6,ROW('quantities report'!$A$2:$A$10003)-1,\"\"),ROWS($B$8:$B8))),\"0\"))","v":""},{"$f":"IF($B8=\"\",\"\",SUM(C8:D8))","v":""},{"$f":"IF($B8=\"\",\"\",IFERROR(INDEX('quantities report'!$D$2:$D$10003,SMALL(IF('quantities report'!$A$2:$A$10003=F$6,ROW('quantities report'!$A$2:$A$10003)-1,\"\"),ROWS($B$8:$B8))),\"0\"))","v":""},{"$f":"IF($B8=\"\",\"\",IFERROR(INDEX('quantities report'!$D$2:$D$10003,SMALL(IF('quantities report'!$A$2:$A$10003=G$6,ROW('quantities report'!$A$2:$A$10003)-1,\"\"),ROWS($B$8:$B8))),\"0\"))","v":""},{"$f":"IF($B8=\"\",\"\",SUM(F8:G8))","v":""},{"$f":"IF($B8=\"\",\"\",IFERROR(INDEX('quantities report'!$D$2:$D$10003,SMALL(IF('quantities report'!$A$2:$A$10003=I$6,ROW('quantities report'!$A$2:$A$10003)-1,\"\"),ROWS($B$8:$B8))),\"0\"))","v":""},{"$f":"IF($B8=\"\",\"\",IFERROR(INDEX('quantities report'!$D$2:$D$10003,SMALL(IF('quantities report'!$A$2:$A$10003=J$6,ROW('quantities report'!$A$2:$A$10003)-1,\"\"),ROWS($B$8:$B8))),\"0\"))","v":""},{"$f":"IF($B8=\"\",\"\",IFERROR(INDEX('quantities report'!$D$2:$D$10003,SMALL(IF('quantities report'!$A$2:$A$10003=K$6,ROW('quantities report'!$A$2:$A$10003)-1,\"\"),ROWS($B$8:$B8))),\"0\"))","v":""},{"$f":"IF($B8=\"\",\"\",IFERROR(INDEX('quantities report'!$D$2:$D$10003,SMALL(IF('quantities report'!$A$2:$A$10003=L$6,ROW('quantities report'!$A$2:$A$10003)-1,\"\"),ROWS($B$8:$B8))),\"0\"))","v":""},{"$f":"IF($B8=\"\",\"\",IFERROR(INDEX('quantities report'!$D$2:$D$10003,SMALL(IF('quantities report'!$A$2:$A$10003=M$6,ROW('quantities report'!$A$2:$A$10003)-1,\"\"),ROWS($B$8:$B8))),\"0\"))","v":""},{"$f":"IF($B8=\"\",\"\",IFERROR(INDEX('quantities report'!$D$2:$D$10003,SMALL(IF('quantities report'!$A$2:$A$10003=N$6,ROW('quantities report'!$A$2:$A$10003)-1,\"\"),ROWS($B$8:$B8))),\"0\"))","v":""},{"$f":"IF($B8=\"\",\"\",IFERROR(INDEX('quantities report'!$D$2:$D$10003,SMALL(IF('quantities report'!$A$2:$A$10003=O$6,ROW('quantities report'!$A$2:$A$10003)-1,\"\"),ROWS($B$8:$B8))),\"0\"))","v":""},{"$f":"IF($B8=\"\",\"\",SUM(M8:O8))","v":""},{"$f":"IF($B8=\"\",\"\",IFERROR(INDEX('quantities report'!$D$2:$D$10003,SMALL(IF('quantities report'!$A$2:$A$10003=Q$6,ROW('quantities report'!$A$2:$A$10003)-1,\"\"),ROWS($B$8:$B8))),\"0\"))","v":""}]
[null,{"$f":"IFERROR(INDEX('manual inputs'!M:M,SMALL(IF('manual inputs'!M:M<>\"\",ROW('manual inputs'!M:M)),ROW(4:4))),\"\")","v":""},{"$f":"IF($B9=\"\",\"\",IFERROR(INDEX('quantities report'!$D$2:$D$10003,SMALL(IF('quantities report'!$A$2:$A$10003=C$6,ROW('quantities report'!$A$2:$A$10003)-1,\"\"),ROWS($B$8:$B9))),\"0\"))","v":""},{"$f":"IF($B9=\"\",\"\",IFERROR(INDEX('quantities report'!$D$2:$D$10003,SMALL(IF('quantities report'!$A$2:$A$10003=D$6,ROW('quantities report'!$A$2:$A$10003)-1,\"\"),ROWS($B$8:$B9))),\"0\"))","v":""},{"$f":"IF($B9=\"\",\"\",SUM(C9:D9))","v":""},{"$f":"IF($B9=\"\",\"\",IFERROR(INDEX('quantities report'!$D$2:$D$10003,SMALL(IF('quantities report'!$A$2:$A$10003=F$6,ROW('quantities report'!$A$2:$A$10003)-1,\"\"),ROWS($B$8:$B9))),\"0\"))","v":""},{"$f":"IF($B9=\"\",\"\",IFERROR(INDEX('quantities report'!$D$2:$D$10003,SMALL(IF('quantities report'!$A$2:$A$10003=G$6,ROW('quantities report'!$A$2:$A$10003)-1,\"\"),ROWS($B$8:$B9))),\"0\"))","v":""},{"$f":"IF($B9=\"\",\"\",SUM(F9:G9))","v":""},{"$f":"IF($B9=\"\",\"\",IFERROR(INDEX('quantities report'!$D$2:$D$10003,SMALL(IF('quantities report'!$A$2:$A$10003=I$6,ROW('quantities report'!$A$2:$A$10003)-1,\"\"),ROWS($B$8:$B9))),\"0\"))","v":""},{"$f":"IF($B9=\"\",\"\",IFERROR(INDEX('quantities report'!$D$2:$D$10003,SMALL(IF('quantities report'!$A$2:$A$10003=J$6,ROW('quantities report'!$A$2:$A$10003)-1,\"\"),ROWS($B$8:$B9))),\"0\"))","v":""},{"$f":"IF($B9=\"\",\"\",IFERROR(INDEX('quantities report'!$D$2:$D$10003,SMALL(IF('quantities report'!$A$2:$A$10003=K$6,ROW('quantities report'!$A$2:$A$10003)-1,\"\"),ROWS($B$8:$B9))),\"0\"))","v":""},{"$f":"IF($B9=\"\",\"\",IFERROR(INDEX('quantities report'!$D$2:$D$10003,SMALL(IF('quantities report'!$A$2:$A$10003=L$6,ROW('quantities report'!$A$2:$A$10003)-1,\"\"),ROWS($B$8:$B9))),\"0\"))","v":""},{"$f":"IF($B9=\"\",\"\",IFERROR(INDEX('quantities report'!$D$2:$D$10003,SMALL(IF('quantities report'!$A$2:$A$10003=M$6,ROW('quantities report'!$A$2:$A$10003)-1,\"\"),ROWS($B$8:$B9))),\"0\"))","v":""},{"$f":"IF($B9=\"\",\"\",IFERROR(INDEX('quantities report'!$D$2:$D$10003,SMALL(IF('quantities report'!$A$2:$A$10003=N$6,ROW('quantities report'!$A$2:$A$10003)-1,\"\"),ROWS($B$8:$B9))),\"0\"))","v":""},{"$f":"IF($B9=\"\",\"\",IFERROR(INDEX('quantities report'!$D$2:$D$10003,SMALL(IF('quantities report'!$A$2:$A$10003=O$6,ROW('quantities report'!$A$2:$A$10003)-1,\"\"),ROWS($B$8:$B9))),\"0\"))","v":""},{"$f":"IF($B9=\"\",\"\",SUM(M9:O9))","v":""},{"$f":"IF($B9=\"\",\"\",IFERROR(INDEX('quantities report'!$D$2:$D$10003,SMALL(IF('quantities report'!$A$2:$A$10003=Q$6,ROW('quantities report'!$A$2:$A$10003)-1,\"\"),ROWS($B$8:$B9))),\"0\"))","v":""}]
[null,{"$f":"IFERROR(INDEX('manual inputs'!M:M,SMALL(IF('manual inputs'!M:M<>\"\",ROW('manual inputs'!M:M)),ROW(5:5))),\"\")","v":""},{"$f":"IF($B10=\"\",\"\",IFERROR(INDEX('quantities report'!$D$2:$D$10003,SMALL(IF('quantities report'!$A$2:$A$10003=C$6,ROW('quantities report'!$A$2:$A$10003)-1,\"\"),ROWS($B$8:$B10))),\"0\"))","v":""},{"$f":"IF($B10=\"\",\"\",IFERROR(INDEX('quantities report'!$D$2:$D$10003,SMALL(IF('quantities report'!$A$2:$A$10003=D$6,ROW('quantities report'!$A$2:$A$10003)-1,\"\"),ROWS($B$8:$B10))),\"0\"))","v":""},"",{"$f":"IF($B10=\"\",\"\",IFERROR(INDEX('quantities report'!$D$2:$D$10003,SMALL(IF('quantities report'!$A$2:$A$10003=F$6,ROW('quantities report'!$A$2:$A$10003)-1,\"\"),ROWS($B$8:$B10))),\"0\"))","v":""},{"$f":"IF($B10=\"\",\"\",IFERROR(INDEX('quantities report'!$D$2:$D$10003,SMALL(IF('quantities report'!$A$2:$A$10003=G$6,ROW('quantities report'!$A$2:$A$10003)-1,\"\"),ROWS($B$8:$B10))),\"0\"))","v":""},"",{"$f":"IF($B10=\"\",\"\",IFERROR(INDEX('quantities report'!$D$2:$D$10003,SMALL(IF('quantities report'!$A$2:$A$10003=I$6,ROW('quantities report'!$A$2:$A$10003)-1,\"\"),ROWS($B$8:$B10))),\"0\"))","v":""},{"$f":"IF($B10=\"\",\"\",IFERROR(INDEX('quantities report'!$D$2:$D$10003,SMALL(IF('quantities report'!$A$2:$A$10003=J$6,ROW('quantities report'!$A$2:$A$10003)-1,\"\"),ROWS($B$8:$B10))),\"0\"))","v":""},{"$f":"IF($B10=\"\",\"\",IFERROR(INDEX('quantities report'!$D$2:$D$10003,SMALL(IF('quantities report'!$A$2:$A$10003=K$6,ROW('quantities report'!$A$2:$A$10003)-1,\"\"),ROWS($B$8:$B10))),\"0\"))","v":""},{"$f":"IF($B10=\"\",\"\",IFERROR(INDEX('quantities report'!$D$2:$D$10003,SMALL(IF('quantities report'!$A$2:$A$10003=L$6,ROW('quantities report'!$A$2:$A$10003)-1,\"\"),ROWS($B$8:$B10))),\"0\"))","v":""},{"$f":"IF($B10=\"\",\"\",IFERROR(INDEX('quantities report'!$D$2:$D$10003,SMALL(IF('quantities report'!$A$2:$A$10003=M$6,ROW('quantities report'!$A$2:$A$10003)-1,\"\"),ROWS($B$8:$B10))),\"0\"))","v":""},{"$f":"IF($B10=\"\",\"\",IFERROR(INDEX('quantities report'!$D$2:$D$10003,SMALL(IF('quantities report'!$A$2:$A$10003=N$6,ROW('quantities report'!$A$2:$A$10003)-1,\"\"),ROWS($B$8:$B10))),\"0\"))","v":""},{"$f":"IF($B10=\"\",\"\",IFERROR(INDEX('quantities report'!$D$2:$D$10003,SMALL(IF('quantities report'!$A$2:$A$10003=O$6,ROW('quantities report'!$A$2:$A$10003)-1,\"\"),ROWS($B$8:$B10))),\"0\"))","v":""},"",{"$f":"IF($B10=\"\",\"\",IFERROR(INDEX('quantities report'!$D$2:$D$10003,SMALL(IF('quantities report'!$A$2:$A$10003=Q$6,ROW('quantities report'!$A$2:$A$10003)-1,\"\"),ROWS($B$8:$B10))),\"0\"))","v":""}]
[null,{"$f":"IFERROR(INDEX('manual inputs'!M:M,SMALL(IF('manual inputs'!M:M<>\"\",ROW('manual inputs'!M:M)),ROW(6:6))),\"\")","v":""},{"$f":"IF($B11=\"\",\"\",IFERROR(INDEX('quantities report'!$D$2:$D$10003,SMALL(IF('quantities report'!$A$2:$A$10003=C$6,ROW('quantities report'!$A$2:$A$10003)-1,\"\"),ROWS($B$8:$B11))),\"0\"))","v":""},{"$f":"IF($B11=\"\",\"\",IFERROR(INDEX('quantities report'!$D$2:$D$10003,SMALL(IF('quantities report'!$A$2:$A$10003=D$6,ROW('quantities report'!$A$2:$A$10003)-1,\"\"),ROWS($B$8:$B11))),\"0\"))","v":""},"",{"$f":"IF($B11=\"\",\"\",IFERROR(INDEX('quantities report'!$D$2:$D$10003,SMALL(IF('quantities report'!$A$2:$A$10003=F$6,ROW('quantities report'!$A$2:$A$10003)-1,\"\"),ROWS($B$8:$B11))),\"0\"))","v":""},{"$f":"IF($B11=\"\",\"\",IFERROR(INDEX('quantities report'!$D$2:$D$10003,SMALL(IF('quantities report'!$A$2:$A$10003=G$6,ROW('quantities report'!$A$2:$A$10003)-1,\"\"),ROWS($B$8:$B11))),\"0\"))","v":""},"",{"$f":"IF($B11=\"\",\"\",IFERROR(INDEX('quantities report'!$D$2:$D$10003,SMALL(IF('quantities report'!$A$2:$A$10003=I$6,ROW('quantities report'!$A$2:$A$10003)-1,\"\"),ROWS($B$8:$B11))),\"0\"))","v":""},{"$f":"IF($B11=\"\",\"\",IFERROR(INDEX('quantities report'!$D$2:$D$10003,SMALL(IF('quantities report'!$A$2:$A$10003=J$6,ROW('quantities report'!$A$2:$A$10003)-1,\"\"),ROWS($B$8:$B11))),\"0\"))","v":""},{"$f":"IF($B11=\"\",\"\",IFERROR(INDEX('quantities report'!$D$2:$D$10003,SMALL(IF('quantities report'!$A$2:$A$10003=K$6,ROW('quantities report'!$A$2:$A$10003)-1,\"\"),ROWS($B$8:$B11))),\"0\"))","v":""},{"$f":"IF($B11=\"\",\"\",IFERROR(INDEX('quantities report'!$D$2:$D$10003,SMALL(IF('quantities report'!$A$2:$A$10003=L$6,ROW('quantities report'!$A$2:$A$10003)-1,\"\"),ROWS($B$8:$B11))),\"0\"))","v":""},{"$f":"IF($B11=\"\",\"\",IFERROR(INDEX('quantities report'!$D$2:$D$10003,SMALL(IF('quantities report'!$A$2:$A$10003=M$6,ROW('quantities report'!$A$2:$A$10003)-1,\"\"),ROWS($B$8:$B11))),\"0\"))","v":""},{"$f":"IF($B11=\"\",\"\",IFERROR(INDEX('quantities report'!$D$2:$D$10003,SMALL(IF('quantities report'!$A$2:$A$10003=N$6,ROW('quantities report'!$A$2:$A$10003)-1,\"\"),ROWS($B$8:$B11))),\"0\"))","v":""},{"$f":"IF($B11=\"\",\"\",IFERROR(INDEX('quantities report'!$D$2:$D$10003,SMALL(IF('quantities report'!$A$2:$A$10003=O$6,ROW('quantities report'!$A$2:$A$10003)-1,\"\"),ROWS($B$8:$B11))),\"0\"))","v":""},"",{"$f":"IF($B11=\"\",\"\",IFERROR(INDEX('quantities report'!$D$2:$D$10003,SMALL(IF('quantities report'!$A$2:$A$10003=Q$6,ROW('quantities report'!$A$2:$A$10003)-1,\"\"),ROWS($B$8:$B11))),\"0\"))","v":""}]
[null,{"$f":"IFERROR(INDEX('manual inputs'!M:M,SMALL(IF('manual inputs'!M:M<>\"\",ROW('manual inputs'!M:M)),ROW(7:7))),\"\")","v":""},{"$f":"IF($B12=\"\",\"\",IFERROR(INDEX('quantities report'!$D$2:$D$10003,SMALL(IF('quantities report'!$A$2:$A$10003=C$6,ROW('quantities report'!$A$2:$A$10003)-1,\"\"),ROWS($B$8:$B12))),\"0\"))","v":""},{"$f":"IF($B12=\"\",\"\",IFERROR(INDEX('quantities report'!$D$2:$D$10003,SMALL(IF('quantities report'!$A$2:$A$10003=D$6,ROW('quantities report'!$A$2:$A$10003)-1,\"\"),ROWS($B$8:$B12))),\"0\"))","v":""},"",{"$f":"IF($B12=\"\",\"\",IFERROR(INDEX('quantities report'!$D$2:$D$10003,SMALL(IF('quantities report'!$A$2:$A$10003=F$6,ROW('quantities report'!$A$2:$A$10003)-1,\"\"),ROWS($B$8:$B12))),\"0\"))","v":""},{"$f":"IF($B12=\"\",\"\",IFERROR(INDEX('quantities report'!$D$2:$D$10003,SMALL(IF('quantities report'!$A$2:$A$10003=G$6,ROW('quantities report'!$A$2:$A$10003)-1,\"\"),ROWS($B$8:$B12))),\"0\"))","v":""},"",{"$f":"IF($B12=\"\",\"\",IFERROR(INDEX('quantities report'!$D$2:$D$10003,SMALL(IF('quantities report'!$A$2:$A$10003=I$6,ROW('quantities report'!$A$2:$A$10003)-1,\"\"),ROWS($B$8:$B12))),\"0\"))","v":""},{"$f":"IF($B12=\"\",\"\",IFERROR(INDEX('quantities report'!$D$2:$D$10003,SMALL(IF('quantities report'!$A$2:$A$10003=J$6,ROW('quantities report'!$A$2:$A$10003)-1,\"\"),ROWS($B$8:$B12))),\"0\"))","v":""},{"$f":"IF($B12=\"\",\"\",IFERROR(INDEX('quantities report'!$D$2:$D$10003,SMALL(IF('quantities report'!$A$2:$A$10003=K$6,ROW('quantities report'!$A$2:$A$10003)-1,\"\"),ROWS($B$8:$B12))),\"0\"))","v":""},{"$f":"IF($B12=\"\",\"\",IFERROR(INDEX('quantities report'!$D$2:$D$10003,SMALL(IF('quantities report'!$A$2:$A$10003=L$6,ROW('quantities report'!$A$2:$A$10003)-1,\"\"),ROWS($B$8:$B12))),\"0\"))","v":""},{"$f":"IF($B12=\"\",\"\",IFERROR(INDEX('quantities report'!$D$2:$D$10003,SMALL(IF('quantities report'!$A$2:$A$10003=M$6,ROW('quantities report'!$A$2:$A$10003)-1,\"\"),ROWS($B$8:$B12))),\"0\"))","v":""},{"$f":"IF($B12=\"\",\"\",IFERROR(INDEX('quantities report'!$D$2:$D$10003,SMALL(IF('quantities report'!$A$2:$A$10003=N$6,ROW('quantities report'!$A$2:$A$10003)-1,\"\"),ROWS($B$8:$B12))),\"0\"))","v":""},{"$f":"IF($B12=\"\",\"\",IFERROR(INDEX('quantities report'!$D$2:$D$10003,SMALL(IF('quantities report'!$A$2:$A$10003=O$6,ROW('quantities report'!$A$2:$A$10003)-1,\"\"),ROWS($B$8:$B12))),\"0\"))","v":""},"",{"$f":"IF($B12=\"\",\"\",IFERROR(INDEX('quantities report'!$D$2:$D$10003,SMALL(IF('quantities report'!$A$2:$A$10003=Q$6,ROW('quantities report'!$A$2:$A$10003)-1,\"\"),ROWS($B$8:$B12))),\"0\"))","v":""}]
[null,{"$f":"IFERROR(INDEX('manual inputs'!M:M,SMALL(IF('manual inputs'!M:M<>\"\",ROW('manual inputs'!M:M)),ROW(8:8))),\"\")","v":""},{"$f":"IF($B13=\"\",\"\",IFERROR(INDEX('quantities report'!$D$2:$D$10003,SMALL(IF('quantities report'!$A$2:$A$10003=C$6,ROW('quantities report'!$A$2:$A$10003)-1,\"\"),ROWS($B$8:$B13))),\"0\"))","v":""},{"$f":"IF($B13=\"\",\"\",IFERROR(INDEX('quantities report'!$D$2:$D$10003,SMALL(IF('quantities report'!$A$2:$A$10003=D$6,ROW('quantities report'!$A$2:$A$10003)-1,\"\"),ROWS($B$8:$B13))),\"0\"))","v":""},"",{"$f":"IF($B13=\"\",\"\",IFERROR(INDEX('quantities report'!$D$2:$D$10003,SMALL(IF('quantities report'!$A$2:$A$10003=F$6,ROW('quantities report'!$A$2:$A$10003)-1,\"\"),ROWS($B$8:$B13))),\"0\"))","v":""},{"$f":"IF($B13=\"\",\"\",IFERROR(INDEX('quantities report'!$D$2:$D$10003,SMALL(IF('quantities report'!$A$2:$A$10003=G$6,ROW('quantities report'!$A$2:$A$10003)-1,\"\"),ROWS($B$8:$B13))),\"0\"))","v":""},"",{"$f":"IF($B13=\"\",\"\",IFERROR(INDEX('quantities report'!$D$2:$D$10003,SMALL(IF('quantities report'!$A$2:$A$10003=I$6,ROW('quantities report'!$A$2:$A$10003)-1,\"\"),ROWS($B$8:$B13))),\"0\"))","v":""},{"$f":"IF($B13=\"\",\"\",IFERROR(INDEX('quantities report'!$D$2:$D$10003,SMALL(IF('quantities report'!$A$2:$A$10003=J$6,ROW('quantities report'!$A$2:$A$10003)-1,\"\"),ROWS($B$8:$B13))),\"0\"))","v":""},{"$f":"IF($B13=\"\",\"\",IFERROR(INDEX('quantities report'!$D$2:$D$10003,SMALL(IF('quantities report'!$A$2:$A$10003=K$6,ROW('quantities report'!$A$2:$A$10003)-1,\"\"),ROWS($B$8:$B13))),\"0\"))","v":""},{"$f":"IF($B13=\"\",\"\",IFERROR(INDEX('quantities report'!$D$2:$D$10003,SMALL(IF('quantities report'!$A$2:$A$10003=L$6,ROW('quantities report'!$A$2:$A$10003)-1,\"\"),ROWS($B$8:$B13))),\"0\"))","v":""},{"$f":"IF($B13=\"\",\"\",IFERROR(INDEX('quantities report'!$D$2:$D$10003,SMALL(IF('quantities report'!$A$2:$A$10003=M$6,ROW('quantities report'!$A$2:$A$10003)-1,\"\"),ROWS($B$8:$B13))),\"0\"))","v":""},{"$f":"IF($B13=\"\",\"\",IFERROR(INDEX('quantities report'!$D$2:$D$10003,SMALL(IF('quantities report'!$A$2:$A$10003=N$6,ROW('quantities report'!$A$2:$A$10003)-1,\"\"),ROWS($B$8:$B13))),\"0\"))","v":""},{"$f":"IF($B13=\"\",\"\",IFERROR(INDEX('quantities report'!$D$2:$D$10003,SMALL(IF('quantities report'!$A$2:$A$10003=O$6,ROW('quantities report'!$A$2:$A$10003)-1,\"\"),ROWS($B$8:$B13))),\"0\"))","v":""},"",{"$f":"IF($B13=\"\",\"\",IFERROR(INDEX('quantities report'!$D$2:$D$10003,SMALL(IF('quantities report'!$A$2:$A$10003=Q$6,ROW('quantities report'!$A$2:$A$10003)-1,\"\"),ROWS($B$8:$B13))),\"0\"))","v":""}]
[null,{"$f":"IFERROR(INDEX('manual inputs'!M:M,SMALL(IF('manual inputs'!M:M<>\"\",ROW('manual inputs'!M:M)),ROW(9:9))),\"\")","v":""},{"$f":"IF($B14=\"\",\"\",IFERROR(INDEX('quantities report'!$D$2:$D$10003,SMALL(IF('quantities report'!$A$2:$A$10003=C$6,ROW('quantities report'!$A$2:$A$10003)-1,\"\"),ROWS($B$8:$B14))),\"0\"))","v":""},{"$f":"IF($B14=\"\",\"\",IFERROR(INDEX('quantities report'!$D$2:$D$10003,SMALL(IF('quantities report'!$A$2:$A$10003=D$6,ROW('quantities report'!$A$2:$A$10003)-1,\"\"),ROWS($B$8:$B14))),\"0\"))","v":""},"",{"$f":"IF($B14=\"\",\"\",IFERROR(INDEX('quantities report'!$D$2:$D$10003,SMALL(IF('quantities report'!$A$2:$A$10003=F$6,ROW('quantities report'!$A$2:$A$10003)-1,\"\"),ROWS($B$8:$B14))),\"0\"))","v":""},{"$f":"IF($B14=\"\",\"\",IFERROR(INDEX('quantities report'!$D$2:$D$10003,SMALL(IF('quantities report'!$A$2:$A$10003=G$6,ROW('quantities report'!$A$2:$A$10003)-1,\"\"),ROWS($B$8:$B14))),\"0\"))","v":""},"",{"$f":"IF($B14=\"\",\"\",IFERROR(INDEX('quantities report'!$D$2:$D$10003,SMALL(IF('quantities report'!$A$2:$A$10003=I$6,ROW('quantities report'!$A$2:$A$10003)-1,\"\"),ROWS($B$8:$B14))),\"0\"))","v":""},{"$f":"IF($B14=\"\",\"\",IFERROR(INDEX('quantities report'!$D$2:$D$10003,SMALL(IF('quantities report'!$A$2:$A$10003=J$6,ROW('quantities report'!$A$2:$A$10003)-1,\"\"),ROWS($B$8:$B14))),\"0\"))","v":""},{"$f":"IF($B14=\"\",\"\",IFERROR(INDEX('quantities report'!$D$2:$D$10003,SMALL(IF('quantities report'!$A$2:$A$10003=K$6,ROW('quantities report'!$A$2:$A$10003)-1,\"\"),ROWS($B$8:$B14))),\"0\"))","v":""},{"$f":"IF($B14=\"\",\"\",IFERROR(INDEX('quantities report'!$D$2:$D$10003,SMALL(IF('quantities report'!$A$2:$A$10003=L$6,ROW('quantities report'!$A$2:$A$10003)-1,\"\"),ROWS($B$8:$B14))),\"0\"))","v":""},{"$f":"IF($B14=\"\",\"\",IFERROR(INDEX('quantities report'!$D$2:$D$10003,SMALL(IF('quantities report'!$A$2:$A$10003=M$6,ROW('quantities report'!$A$2:$A$10003)-1,\"\"),ROWS($B$8:$B14))),\"0\"))","v":""},{"$f":"IF($B14=\"\",\"\",IFERROR(INDEX('quantities report'!$D$2:$D$10003,SMALL(IF('quantities report'!$A$2:$A$10003=N$6,ROW('quantities report'!$A$2:$A$10003)-1,\"\"),ROWS($B$8:$B14))),\"0\"))","v":""},{"$f":"IF($B14=\"\",\"\",IFERROR(INDEX('quantities report'!$D$2:$D$10003,SMALL(IF('quantities report'!$A$2:$A$10003=O$6,ROW('quantities report'!$A$2:$A$10003)-1,\"\"),ROWS($B$8:$B14))),\"0\"))","v":""},"",{"$f":"IF($B14=\"\",\"\",IFERROR(INDEX('quantities report'!$D$2:$D$10003,SMALL(IF('quantities report'!$A$2:$A$10003=Q$6,ROW('quantities report'!$A$2:$A$10003)-1,\"\"),ROWS($B$8:$B14))),\"0\"))","v":""}]
[null,{"$f":"IFERROR(INDEX('manual inputs'!M:M,SMALL(IF('manual inputs'!M:M<>\"\",ROW('manual inputs'!M:M)),ROW(10:10))),\"\")","v":""},{"$f":"IF($B15=\"\",\"\",IFERROR(INDEX('quantities report'!$D$2:$D$10003,SMALL(IF('quantities report'!$A$2:$A$10003=C$6,ROW('quantities report'!$A$2:$A$10003)-1,\"\"),ROWS($B$8:$B15))),\"0\"))","v":""},{"$f":"IF($B15=\"\",\"\",IFERROR(INDEX('quantities report'!$D$2:$D$10003,SMALL(IF('quantities report'!$A$2:$A$10003=D$6,ROW('quantities report'!$A$2:$A$10003)-1,\"\"),ROWS($B$8:$B15))),\"0\"))","v":""},"",{"$f":"IF($B15=\"\",\"\",IFERROR(INDEX('quantities report'!$D$2:$D$10003,SMALL(IF('quantities report'!$A$2:$A$10003=F$6,ROW('quantities report'!$A$2:$A$10003)-1,\"\"),ROWS($B$8:$B15))),\"0\"))","v":""},{"$f":"IF($B15=\"\",\"\",IFERROR(INDEX('quantities report'!$D$2:$D$10003,SMALL(IF('quantities report'!$A$2:$A$10003=G$6,ROW('quantities report'!$A$2:$A$10003)-1,\"\"),ROWS($B$8:$B15))),\"0\"))","v":""},"",{"$f":"IF($B15=\"\",\"\",IFERROR(INDEX('quantities report'!$D$2:$D$10003,SMALL(IF('quantities report'!$A$2:$A$10003=I$6,ROW('quantities report'!$A$2:$A$10003)-1,\"\"),ROWS($B$8:$B15))),\"0\"))","v":""},{"$f":"IF($B15=\"\",\"\",IFERROR(INDEX('quantities report'!$D$2:$D$10003,SMALL(IF('quantities report'!$A$2:$A$10003=J$6,ROW('quantities report'!$A$2:$A$10003)-1,\"\"),ROWS($B$8:$B15))),\"0\"))","v":""},{"$f":"IF($B15=\"\",\"\",IFERROR(INDEX('quantities report'!$D$2:$D$10003,SMALL(IF('quantities report'!$A$2:$A$10003=K$6,ROW('quantities report'!$A$2:$A$10003)-1,\"\"),ROWS($B$8:$B15))),\"0\"))","v":""},{"$f":"IF($B15=\"\",\"\",IFERROR(INDEX('quantities report'!$D$2:$D$10003,SMALL(IF('quantities report'!$A$2:$A$10003=L$6,ROW('quantities report'!$A$2:$A$10003)-1,\"\"),ROWS($B$8:$B15))),\"0\"))","v":""},{"$f":"IF($B15=\"\",\"\",IFERROR(INDEX('quantities report'!$D$2:$D$10003,SMALL(IF('quantities report'!$A$2:$A$10003=M$6,ROW('quantities report'!$A$2:$A$10003)-1,\"\"),ROWS($B$8:$B15))),\"0\"))","v":""},{"$f":"IF($B15=\"\",\"\",IFERROR(INDEX('quantities report'!$D$2:$D$10003,SMALL(IF('quantities report'!$A$2:$A$10003=N$6,ROW('quantities report'!$A$2:$A$10003)-1,\"\"),ROWS($B$8:$B15))),\"0\"))","v":""},{"$f":"IF($B15=\"\",\"\",IFERROR(INDEX('quantities report'!$D$2:$D$10003,SMALL(IF('quantities report'!$A$2:$A$10003=O$6,ROW('quantities report'!$A$2:$A$10003)-1,\"\"),ROWS($B$8:$B15))),\"0\"))","v":""},"",{"$f":"IF($B15=\"\",\"\",IFERROR(INDEX('quantities report'!$D$2:$D$10003,SMALL(IF('quantities report'!$A$2:$A$10003=Q$6,ROW('quantities report'!$A$2:$A$10003)-1,\"\"),ROWS($B$8:$B15))),\"0\"))","v":""}]
[null,{"$f":"IFERROR(INDEX('manual inputs'!M:M,SMALL(IF('manual inputs'!M:M<>\"\",ROW('manual inputs'!M:M)),ROW(11:11))),\"\")","v":""},{"$f":"IF($B16=\"\",\"\",IFERROR(INDEX('quantities report'!$D$2:$D$10003,SMALL(IF('quantities report'!$A$2:$A$10003=C$6,ROW('quantities report'!$A$2:$A$10003)-1,\"\"),ROWS($B$8:$B16))),\"0\"))","v":""},{"$f":"IF($B16=\"\",\"\",IFERROR(INDEX('quantities report'!$D$2:$D$10003,SMALL(IF('quantities report'!$A$2:$A$10003=D$6,ROW('quantities report'!$A$2:$A$10003)-1,\"\"),ROWS($B$8:$B16))),\"0\"))","v":""},"",{"$f":"IF($B16=\"\",\"\",IFERROR(INDEX('quantities report'!$D$2:$D$10003,SMALL(IF('quantities report'!$A$2:$A$10003=F$6,ROW('quantities report'!$A$2:$A$10003)-1,\"\"),ROWS($B$8:$B16))),\"0\"))","v":""},{"$f":"IF($B16=\"\",\"\",IFERROR(INDEX('quantities report'!$D$2:$D$10003,SMALL(IF('quantities report'!$A$2:$A$10003=G$6,ROW('quantities report'!$A$2:$A$10003)-1,\"\"),ROWS($B$8:$B16))),\"0\"))","v":""},"",{"$f":"IF($B16=\"\",\"\",IFERROR(INDEX('quantities report'!$D$2:$D$10003,SMALL(IF('quantities report'!$A$2:$A$10003=I$6,ROW('quantities report'!$A$2:$A$10003)-1,\"\"),ROWS($B$8:$B16))),\"0\"))","v":""},{"$f":"IF($B16=\"\",\"\",IFERROR(INDEX('quantities report'!$D$2:$D$10003,SMALL(IF('quantities report'!$A$2:$A$10003=J$6,ROW('quantities report'!$A$2:$A$10003)-1,\"\"),ROWS($B$8:$B16))),\"0\"))","v":""},{"$f":"IF($B16=\"\",\"\",IFERROR(INDEX('quantities report'!$D$2:$D$10003,SMALL(IF('quantities report'!$A$2:$A$10003=K$6,ROW('quantities report'!$A$2:$A$10003)-1,\"\"),ROWS($B$8:$B16))),\"0\"))","v":""},{"$f":"IF($B16=\"\",\"\",IFERROR(INDEX('quantities report'!$D$2:$D$10003,SMALL(IF('quantities report'!$A$2:$A$10003=L$6,ROW('quantities report'!$A$2:$A$10003)-1,\"\"),ROWS($B$8:$B16))),\"0\"))","v":""},{"$f":"IF($B16=\"\",\"\",IFERROR(INDEX('quantities report'!$D$2:$D$10003,SMALL(IF('quantities report'!$A$2:$A$10003=M$6,ROW('quantities report'!$A$2:$A$10003)-1,\"\"),ROWS($B$8:$B16))),\"0\"))","v":""},{"$f":"IF($B16=\"\",\"\",IFERROR(INDEX('quantities report'!$D$2:$D$10003,SMALL(IF('quantities report'!$A$2:$A$10003=N$6,ROW('quantities report'!$A$2:$A$10003)-1,\"\"),ROWS($B$8:$B16))),\"0\"))","v":""},{"$f":"IF($B16=\"\",\"\",IFERROR(INDEX('quantities report'!$D$2:$D$10003,SMALL(IF('quantities report'!$A$2:$A$10003=O$6,ROW('quantities report'!$A$2:$A$10003)-1,\"\"),ROWS($B$8:$B16))),\"0\"))","v":""},"",{"$f":"IF($B16=\"\",\"\",IFERROR(INDEX('quantities report'!$D$2:$D$10003,SMALL(IF('quantities report'!$A$2:$A$10003=Q$6,ROW('quantities report'!$A$2:$A$10003)-1,\"\"),ROWS($B$8:$B16))),\"0\"))","v":""}]
[null,{"$f":"IFERROR(INDEX('manual inputs'!M:M,SMALL(IF('manual inputs'!M:M<>\"\",ROW('manual inputs'!M:M)),ROW(12:12))),\"\")","v":""},{"$f":"IF($B17=\"\",\"\",IFERROR(INDEX('quantities report'!$D$2:$D$10003,SMALL(IF('quantities report'!$A$2:$A$10003=C$6,ROW('quantities report'!$A$2:$A$10003)-1,\"\"),ROWS($B$8:$B17))),\"0\"))","v":""},{"$f":"IF($B17=\"\",\"\",IFERROR(INDEX('quantities report'!$D$2:$D$10003,SMALL(IF('quantities report'!$A$2:$A$10003=D$6,ROW('quantities report'!$A$2:$A$10003)-1,\"\"),ROWS($B$8:$B17))),\"0\"))","v":""},"",{"$f":"IF($B17=\"\",\"\",IFERROR(INDEX('quantities report'!$D$2:$D$10003,SMALL(IF('quantities report'!$A$2:$A$10003=F$6,ROW('quantities report'!$A$2:$A$10003)-1,\"\"),ROWS($B$8:$B17))),\"0\"))","v":""},{"$f":"IF($B17=\"\",\"\",IFERROR(INDEX('quantities report'!$D$2:$D$10003,SMALL(IF('quantities report'!$A$2:$A$10003=G$6,ROW('quantities report'!$A$2:$A$10003)-1,\"\"),ROWS($B$8:$B17))),\"0\"))","v":""},"",{"$f":"IF($B17=\"\",\"\",IFERROR(INDEX('quantities report'!$D$2:$D$10003,SMALL(IF('quantities report'!$A$2:$A$10003=I$6,ROW('quantities report'!$A$2:$A$10003)-1,\"\"),ROWS($B$8:$B17))),\"0\"))","v":""},{"$f":"IF($B17=\"\",\"\",IFERROR(INDEX('quantities report'!$D$2:$D$10003,SMALL(IF('quantities report'!$A$2:$A$10003=J$6,ROW('quantities report'!$A$2:$A$10003)-1,\"\"),ROWS($B$8:$B17))),\"0\"))","v":""},{"$f":"IF($B17=\"\",\"\",IFERROR(INDEX('quantities report'!$D$2:$D$10003,SMALL(IF('quantities report'!$A$2:$A$10003=K$6,ROW('quantities report'!$A$2:$A$10003)-1,\"\"),ROWS($B$8:$B17))),\"0\"))","v":""},{"$f":"IF($B17=\"\",\"\",IFERROR(INDEX('quantities report'!$D$2:$D$10003,SMALL(IF('quantities report'!$A$2:$A$10003=L$6,ROW('quantities report'!$A$2:$A$10003)-1,\"\"),ROWS($B$8:$B17))),\"0\"))","v":""},{"$f":"IF($B17=\"\",\"\",IFERROR(INDEX('quantities report'!$D$2:$D$10003,SMALL(IF('quantities report'!$A$2:$A$10003=M$6,ROW('quantities report'!$A$2:$A$10003)-1,\"\"),ROWS($B$8:$B17))),\"0\"))","v":""},{"$f":"IF($B17=\"\",\"\",IFERROR(INDEX('quantities report'!$D$2:$D$10003,SMALL(IF('quantities report'!$A$2:$A$10003=N$6,ROW('quantities report'!$A$2:$A$10003)-1,\"\"),ROWS($B$8:$B17))),\"0\"))","v":""},{"$f":"IF($B17=\"\",\"\",IFERROR(INDEX('quantities report'!$D$2:$D$10003,SMALL(IF('quantities report'!$A$2:$A$10003=O$6,ROW('quantities report'!$A$2:$A$10003)-1,\"\"),ROWS($B$8:$B17))),\"0\"))","v":""},"",{"$f":"IF($B17=\"\",\"\",IFERROR(INDEX('quantities report'!$D$2:$D$10003,SMALL(IF('quantities report'!$A$2:$A$10003=Q$6,ROW('quantities report'!$A$2:$A$10003)-1,\"\"),ROWS($B$8:$B17))),\"0\"))","v":""}]
[null,{"$f":"IFERROR(INDEX('manual inputs'!M:M,SMALL(IF('manual inputs'!M:M<>\"\",ROW('manual inputs'!M:M)),ROW(13:13))),\"\")","v":""},{"$f":"IF($B18=\"\",\"\",IFERROR(INDEX('quantities report'!$D$2:$D$10003,SMALL(IF('quantities report'!$A$2:$A$10003=C$6,ROW('quantities report'!$A$2:$A$10003)-1,\"\"),ROWS($B$8:$B18))),\"0\"))","v":""},{"$f":"IF($B18=\"\",\"\",IFERROR(INDEX('quantities report'!$D$2:$D$10003,SMALL(IF('quantities report'!$A$2:$A$10003=D$6,ROW('quantities report'!$A$2:$A$10003)-1,\"\"),ROWS($B$8:$B18))),\"0\"))","v":""},"",{"$f":"IF($B18=\"\",\"\",IFERROR(INDEX('quantities report'!$D$2:$D$10003,SMALL(IF('quantities report'!$A$2:$A$10003=F$6,ROW('quantities report'!$A$2:$A$10003)-1,\"\"),ROWS($B$8:$B18))),\"0\"))","v":""},{"$f":"IF($B18=\"\",\"\",IFERROR(INDEX('quantities report'!$D$2:$D$10003,SMALL(IF('quantities report'!$A$2:$A$10003=G$6,ROW('quantities report'!$A$2:$A$10003)-1,\"\"),ROWS($B$8:$B18))),\"0\"))","v":""},"",{"$f":"IF($B18=\"\",\"\",IFERROR(INDEX('quantities report'!$D$2:$D$10003,SMALL(IF('quantities report'!$A$2:$A$10003=I$6,ROW('quantities report'!$A$2:$A$10003)-1,\"\"),ROWS($B$8:$B18))),\"0\"))","v":""},{"$f":"IF($B18=\"\",\"\",IFERROR(INDEX('quantities report'!$D$2:$D$10003,SMALL(IF('quantities report'!$A$2:$A$10003=J$6,ROW('quantities report'!$A$2:$A$10003)-1,\"\"),ROWS($B$8:$B18))),\"0\"))","v":""},{"$f":"IF($B18=\"\",\"\",IFERROR(INDEX('quantities report'!$D$2:$D$10003,SMALL(IF('quantities report'!$A$2:$A$10003=K$6,ROW('quantities report'!$A$2:$A$10003)-1,\"\"),ROWS($B$8:$B18))),\"0\"))","v":""},{"$f":"IF($B18=\"\",\"\",IFERROR(INDEX('quantities report'!$D$2:$D$10003,SMALL(IF('quantities report'!$A$2:$A$10003=L$6,ROW('quantities report'!$A$2:$A$10003)-1,\"\"),ROWS($B$8:$B18))),\"0\"))","v":""},{"$f":"IF($B18=\"\",\"\",IFERROR(INDEX('quantities report'!$D$2:$D$10003,SMALL(IF('quantities report'!$A$2:$A$10003=M$6,ROW('quantities report'!$A$2:$A$10003)-1,\"\"),ROWS($B$8:$B18))),\"0\"))","v":""},{"$f":"IF($B18=\"\",\"\",IFERROR(INDEX('quantities report'!$D$2:$D$10003,SMALL(IF('quantities report'!$A$2:$A$10003=N$6,ROW('quantities report'!$A$2:$A$10003)-1,\"\"),ROWS($B$8:$B18))),\"0\"))","v":""},{"$f":"IF($B18=\"\",\"\",IFERROR(INDEX('quantities report'!$D$2:$D$10003,SMALL(IF('quantities report'!$A$2:$A$10003=O$6,ROW('quantities report'!$A$2:$A$10003)-1,\"\"),ROWS($B$8:$B18))),\"0\"))","v":""},"",{"$f":"IF($B18=\"\",\"\",IFERROR(INDEX('quantities report'!$D$2:$D$10003,SMALL(IF('quantities report'!$A$2:$A$10003=Q$6,ROW('quantities report'!$A$2:$A$10003)-1,\"\"),ROWS($B$8:$B18))),\"0\"))","v":""}]
[null,{"$f":"IFERROR(INDEX('manual inputs'!M:M,SMALL(IF('manual inputs'!M:M<>\"\",ROW('manual inputs'!M:M)),ROW(14:14))),\"\")","v":""},{"$f":"IF($B19=\"\",\"\",IFERROR(INDEX('quantities report'!$D$2:$D$10003,SMALL(IF('quantities report'!$A$2:$A$10003=C$6,ROW('quantities report'!$A$2:$A$10003)-1,\"\"),ROWS($B$8:$B19))),\"0\"))","v":""},{"$f":"IF($B19=\"\",\"\",IFERROR(INDEX('quantities report'!$D$2:$D$10003,SMALL(IF('quantities report'!$A$2:$A$10003=D$6,ROW('quantities report'!$A$2:$A$10003)-1,\"\"),ROWS($B$8:$B19))),\"0\"))","v":""},"",{"$f":"IF($B19=\"\",\"\",IFERROR(INDEX('quantities report'!$D$2:$D$10003,SMALL(IF('quantities report'!$A$2:$A$10003=F$6,ROW('quantities report'!$A$2:$A$10003)-1,\"\"),ROWS($B$8:$B19))),\"0\"))","v":""},{"$f":"IF($B19=\"\",\"\",IFERROR(INDEX('quantities report'!$D$2:$D$10003,SMALL(IF('quantities report'!$A$2:$A$10003=G$6,ROW('quantities report'!$A$2:$A$10003)-1,\"\"),ROWS($B$8:$B19))),\"0\"))","v":""},"",{"$f":"IF($B19=\"\",\"\",IFERROR(INDEX('quantities report'!$D$2:$D$10003,SMALL(IF('quantities report'!$A$2:$A$10003=I$6,ROW('quantities report'!$A$2:$A$10003)-1,\"\"),ROWS($B$8:$B19))),\"0\"))","v":""},{"$f":"IF($B19=\"\",\"\",IFERROR(INDEX('quantities report'!$D$2:$D$10003,SMALL(IF('quantities report'!$A$2:$A$10003=J$6,ROW('quantities report'!$A$2:$A$10003)-1,\"\"),ROWS($B$8:$B19))),\"0\"))","v":""},{"$f":"IF($B19=\"\",\"\",IFERROR(INDEX('quantities report'!$D$2:$D$10003,SMALL(IF('quantities report'!$A$2:$A$10003=K$6,ROW('quantities report'!$A$2:$A$10003)-1,\"\"),ROWS($B$8:$B19))),\"0\"))","v":""},{"$f":"IF($B19=\"\",\"\",IFERROR(INDEX('quantities report'!$D$2:$D$10003,SMALL(IF('quantities report'!$A$2:$A$10003=L$6,ROW('quantities report'!$A$2:$A$10003)-1,\"\"),ROWS($B$8:$B19))),\"0\"))","v":""},{"$f":"IF($B19=\"\",\"\",IFERROR(INDEX('quantities report'!$D$2:$D$10003,SMALL(IF('quantities report'!$A$2:$A$10003=M$6,ROW('quantities report'!$A$2:$A$10003)-1,\"\"),ROWS($B$8:$B19))),\"0\"))","v":""},{"$f":"IF($B19=\"\",\"\",IFERROR(INDEX('quantities report'!$D$2:$D$10003,SMALL(IF('quantities report'!$A$2:$A$10003=N$6,ROW('quantities report'!$A$2:$A$10003)-1,\"\"),ROWS($B$8:$B19))),\"0\"))","v":""},{"$f":"IF($B19=\"\",\"\",IFERROR(INDEX('quantities report'!$D$2:$D$10003,SMALL(IF('quantities report'!$A$2:$A$10003=O$6,ROW('quantities report'!$A$2:$A$10003)-1,\"\"),ROWS($B$8:$B19))),\"0\"))","v":""},"",{"$f":"IF($B19=\"\",\"\",IFERROR(INDEX('quantities report'!$D$2:$D$10003,SMALL(IF('quantities report'!$A$2:$A$10003=Q$6,ROW('quantities report'!$A$2:$A$10003)-1,\"\"),ROWS($B$8:$B19))),\"0\"))","v":""}]
[null,{"$f":"IFERROR(INDEX('manual inputs'!M:M,SMALL(IF('manual inputs'!M:M<>\"\",ROW('manual inputs'!M:M)),ROW(15:15))),\"\")","v":""},{"$f":"IF($B20=\"\",\"\",IFERROR(INDEX('quantities report'!$D$2:$D$10003,SMALL(IF('quantities report'!$A$2:$A$10003=C$6,ROW('quantities report'!$A$2:$A$10003)-1,\"\"),ROWS($B$8:$B20))),\"0\"))","v":""},{"$f":"IF($B20=\"\",\"\",IFERROR(INDEX('quantities report'!$D$2:$D$10003,SMALL(IF('quantities report'!$A$2:$A$10003=D$6,ROW('quantities report'!$A$2:$A$10003)-1,\"\"),ROWS($B$8:$B20))),\"0\"))","v":""},"",{"$f":"IF($B20=\"\",\"\",IFERROR(INDEX('quantities report'!$D$2:$D$10003,SMALL(IF('quantities report'!$A$2:$A$10003=F$6,ROW('quantities report'!$A$2:$A$10003)-1,\"\"),ROWS($B$8:$B20))),\"0\"))","v":""},{"$f":"IF($B20=\"\",\"\",IFERROR(INDEX('quantities report'!$D$2:$D$10003,SMALL(IF('quantities report'!$A$2:$A$10003=G$6,ROW('quantities report'!$A$2:$A$10003)-1,\"\"),ROWS($B$8:$B20))),\"0\"))","v":""},"",{"$f":"IF($B20=\"\",\"\",IFERROR(INDEX('quantities report'!$D$2:$D$10003,SMALL(IF('quantities report'!$A$2:$A$10003=I$6,ROW('quantities report'!$A$2:$A$10003)-1,\"\"),ROWS($B$8:$B20))),\"0\"))","v":""},{"$f":"IF($B20=\"\",\"\",IFERROR(INDEX('quantities report'!$D$2:$D$10003,SMALL(IF('quantities report'!$A$2:$A$10003=J$6,ROW('quantities report'!$A$2:$A$10003)-1,\"\"),ROWS($B$8:$B20))),\"0\"))","v":""},{"$f":"IF($B20=\"\",\"\",IFERROR(INDEX('quantities report'!$D$2:$D$10003,SMALL(IF('quantities report'!$A$2:$A$10003=K$6,ROW('quantities report'!$A$2:$A$10003)-1,\"\"),ROWS($B$8:$B20))),\"0\"))","v":""},{"$f":"IF($B20=\"\",\"\",IFERROR(INDEX('quantities report'!$D$2:$D$10003,SMALL(IF('quantities report'!$A$2:$A$10003=L$6,ROW('quantities report'!$A$2:$A$10003)-1,\"\"),ROWS($B$8:$B20))),\"0\"))","v":""},{"$f":"IF($B20=\"\",\"\",IFERROR(INDEX('quantities report'!$D$2:$D$10003,SMALL(IF('quantities report'!$A$2:$A$10003=M$6,ROW('quantities report'!$A$2:$A$10003)-1,\"\"),ROWS($B$8:$B20))),\"0\"))","v":""},{"$f":"IF($B20=\"\",\"\",IFERROR(INDEX('quantities report'!$D$2:$D$10003,SMALL(IF('quantities report'!$A$2:$A$10003=N$6,ROW('quantities report'!$A$2:$A$10003)-1,\"\"),ROWS($B$8:$B20))),\"0\"))","v":""},{"$f":"IF($B20=\"\",\"\",IFERROR(INDEX('quantities report'!$D$2:$D$10003,SMALL(IF('quantities report'!$A$2:$A$10003=O$6,ROW('quantities report'!$A$2:$A$10003)-1,\"\"),ROWS($B$8:$B20))),\"0\"))","v":""},"",{"$f":"IF($B20=\"\",\"\",IFERROR(INDEX('quantities report'!$D$2:$D$10003,SMALL(IF('quantities report'!$A$2:$A$10003=Q$6,ROW('quantities report'!$A$2:$A$10003)-1,\"\"),ROWS($B$8:$B20))),\"0\"))","v":""}]
[null,{"$f":"IFERROR(INDEX('manual inputs'!M:M,SMALL(IF('manual inputs'!M:M<>\"\",ROW('manual inputs'!M:M)),ROW(16:16))),\"\")","v":""},{"$f":"IF($B21=\"\",\"\",IFERROR(INDEX('quantities report'!$D$2:$D$10003,SMALL(IF('quantities report'!$A$2:$A$10003=C$6,ROW('quantities report'!$A$2:$A$10003)-1,\"\"),ROWS($B$8:$B21))),\"0\"))","v":""},{"$f":"IF($B21=\"\",\"\",IFERROR(INDEX('quantities report'!$D$2:$D$10003,SMALL(IF('quantities report'!$A$2:$A$10003=D$6,ROW('quantities report'!$A$2:$A$10003)-1,\"\"),ROWS($B$8:$B21))),\"0\"))","v":""},"",{"$f":"IF($B21=\"\",\"\",IFERROR(INDEX('quantities report'!$D$2:$D$10003,SMALL(IF('quantities report'!$A$2:$A$10003=F$6,ROW('quantities report'!$A$2:$A$10003)-1,\"\"),ROWS($B$8:$B21))),\"0\"))","v":""},{"$f":"IF($B21=\"\",\"\",IFERROR(INDEX('quantities report'!$D$2:$D$10003,SMALL(IF('quantities report'!$A$2:$A$10003=G$6,ROW('quantities report'!$A$2:$A$10003)-1,\"\"),ROWS($B$8:$B21))),\"0\"))","v":""},"",{"$f":"IF($B21=\"\",\"\",IFERROR(INDEX('quantities report'!$D$2:$D$10003,SMALL(IF('quantities report'!$A$2:$A$10003=I$6,ROW('quantities report'!$A$2:$A$10003)-1,\"\"),ROWS($B$8:$B21))),\"0\"))","v":""},{"$f":"IF($B21=\"\",\"\",IFERROR(INDEX('quantities report'!$D$2:$D$10003,SMALL(IF('quantities report'!$A$2:$A$10003=J$6,ROW('quantities report'!$A$2:$A$10003)-1,\"\"),ROWS($B$8:$B21))),\"0\"))","v":""},{"$f":"IF($B21=\"\",\"\",IFERROR(INDEX('quantities report'!$D$2:$D$10003,SMALL(IF('quantities report'!$A$2:$A$10003=K$6,ROW('quantities report'!$A$2:$A$10003)-1,\"\"),ROWS($B$8:$B21))),\"0\"))","v":""},{"$f":"IF($B21=\"\",\"\",IFERROR(INDEX('quantities report'!$D$2:$D$10003,SMALL(IF('quantities report'!$A$2:$A$10003=L$6,ROW('quantities report'!$A$2:$A$10003)-1,\"\"),ROWS($B$8:$B21))),\"0\"))","v":""},{"$f":"IF($B21=\"\",\"\",IFERROR(INDEX('quantities report'!$D$2:$D$10003,SMALL(IF('quantities report'!$A$2:$A$10003=M$6,ROW('quantities report'!$A$2:$A$10003)-1,\"\"),ROWS($B$8:$B21))),\"0\"))","v":""},{"$f":"IF($B21=\"\",\"\",IFERROR(INDEX('quantities report'!$D$2:$D$10003,SMALL(IF('quantities report'!$A$2:$A$10003=N$6,ROW('quantities report'!$A$2:$A$10003)-1,\"\"),ROWS($B$8:$B21))),\"0\"))","v":""},{"$f":"IF($B21=\"\",\"\",IFERROR(INDEX('quantities report'!$D$2:$D$10003,SMALL(IF('quantities report'!$A$2:$A$10003=O$6,ROW('quantities report'!$A$2:$A$10003)-1,\"\"),ROWS($B$8:$B21))),\"0\"))","v":""},"",{"$f":"IF($B21=\"\",\"\",IFERROR(INDEX('quantities report'!$D$2:$D$10003,SMALL(IF('quantities report'!$A$2:$A$10003=Q$6,ROW('quantities report'!$A$2:$A$10003)-1,\"\"),ROWS($B$8:$B21))),\"0\"))","v":""}]
[null,{"$f":"IFERROR(INDEX('manual inputs'!M:M,SMALL(IF('manual inputs'!M:M<>\"\",ROW('manual inputs'!M:M)),ROW(17:17))),\"\")","v":""},{"$f":"IF($B22=\"\",\"\",IFERROR(INDEX('quantities report'!$D$2:$D$10003,SMALL(IF('quantities report'!$A$2:$A$10003=C$6,ROW('quantities report'!$A$2:$A$10003)-1,\"\"),ROWS($B$8:$B22))),\"0\"))","v":""},{"$f":"IF($B22=\"\",\"\",IFERROR(INDEX('quantities report'!$D$2:$D$10003,SMALL(IF('quantities report'!$A$2:$A$10003=D$6,ROW('quantities report'!$A$2:$A$10003)-1,\"\"),ROWS($B$8:$B22))),\"0\"))","v":""},"",{"$f":"IF($B22=\"\",\"\",IFERROR(INDEX('quantities report'!$D$2:$D$10003,SMALL(IF('quantities report'!$A$2:$A$10003=F$6,ROW('quantities report'!$A$2:$A$10003)-1,\"\"),ROWS($B$8:$B22))),\"0\"))","v":""},{"$f":"IF($B22=\"\",\"\",IFERROR(INDEX('quantities report'!$D$2:$D$10003,SMALL(IF('quantities report'!$A$2:$A$10003=G$6,ROW('quantities report'!$A$2:$A$10003)-1,\"\"),ROWS($B$8:$B22))),\"0\"))","v":""},"",{"$f":"IF($B22=\"\",\"\",IFERROR(INDEX('quantities report'!$D$2:$D$10003,SMALL(IF('quantities report'!$A$2:$A$10003=I$6,ROW('quantities report'!$A$2:$A$10003)-1,\"\"),ROWS($B$8:$B22))),\"0\"))","v":""},{"$f":"IF($B22=\"\",\"\",IFERROR(INDEX('quantities report'!$D$2:$D$10003,SMALL(IF('quantities report'!$A$2:$A$10003=J$6,ROW('quantities report'!$A$2:$A$10003)-1,\"\"),ROWS($B$8:$B22))),\"0\"))","v":""},{"$f":"IF($B22=\"\",\"\",IFERROR(INDEX('quantities report'!$D$2:$D$10003,SMALL(IF('quantities report'!$A$2:$A$10003=K$6,ROW('quantities report'!$A$2:$A$10003)-1,\"\"),ROWS($B$8:$B22))),\"0\"))","v":""},{"$f":"IF($B22=\"\",\"\",IFERROR(INDEX('quantities report'!$D$2:$D$10003,SMALL(IF('quantities report'!$A$2:$A$10003=L$6,ROW('quantities report'!$A$2:$A$10003)-1,\"\"),ROWS($B$8:$B22))),\"0\"))","v":""},{"$f":"IF($B22=\"\",\"\",IFERROR(INDEX('quantities report'!$D$2:$D$10003,SMALL(IF('quantities report'!$A$2:$A$10003=M$6,ROW('quantities report'!$A$2:$A$10003)-1,\"\"),ROWS($B$8:$B22))),\"0\"))","v":""},{"$f":"IF($B22=\"\",\"\",IFERROR(INDEX('quantities report'!$D$2:$D$10003,SMALL(IF('quantities report'!$A$2:$A$10003=N$6,ROW('quantities report'!$A$2:$A$10003)-1,\"\"),ROWS($B$8:$B22))),\"0\"))","v":""},{"$f":"IF($B22=\"\",\"\",IFERROR(INDEX('quantities report'!$D$2:$D$10003,SMALL(IF('quantities report'!$A$2:$A$10003=O$6,ROW('quantities report'!$A$2:$A$10003)-1,\"\"),ROWS($B$8:$B22))),\"0\"))","v":""},"",{"$f":"IF($B22=\"\",\"\",IFERROR(INDEX('quantities report'!$D$2:$D$10003,SMALL(IF('quantities report'!$A$2:$A$10003=Q$6,ROW('quantities report'!$A$2:$A$10003)-1,\"\"),ROWS($B$8:$B22))),\"0\"))","v":""}]
[null,{"$f":"IFERROR(INDEX('manual inputs'!M:M,SMALL(IF('manual inputs'!M:M<>\"\",ROW('manual inputs'!M:M)),ROW(18:18))),\"\")","v":""},{"$f":"IF($B23=\"\",\"\",IFERROR(INDEX('quantities report'!$D$2:$D$10003,SMALL(IF('quantities report'!$A$2:$A$10003=C$6,ROW('quantities report'!$A$2:$A$10003)-1,\"\"),ROWS($B$8:$B23))),\"0\"))","v":""},{"$f":"IF($B23=\"\",\"\",IFERROR(INDEX('quantities report'!$D$2:$D$10003,SMALL(IF('quantities report'!$A$2:$A$10003=D$6,ROW('quantities report'!$A$2:$A$10003)-1,\"\"),ROWS($B$8:$B23))),\"0\"))","v":""},"",{"$f":"IF($B23=\"\",\"\",IFERROR(INDEX('quantities report'!$D$2:$D$10003,SMALL(IF('quantities report'!$A$2:$A$10003=F$6,ROW('quantities report'!$A$2:$A$10003)-1,\"\"),ROWS($B$8:$B23))),\"0\"))","v":""},{"$f":"IF($B23=\"\",\"\",IFERROR(INDEX('quantities report'!$D$2:$D$10003,SMALL(IF('quantities report'!$A$2:$A$10003=G$6,ROW('quantities report'!$A$2:$A$10003)-1,\"\"),ROWS($B$8:$B23))),\"0\"))","v":""},"",{"$f":"IF($B23=\"\",\"\",IFERROR(INDEX('quantities report'!$D$2:$D$10003,SMALL(IF('quantities report'!$A$2:$A$10003=I$6,ROW('quantities report'!$A$2:$A$10003)-1,\"\"),ROWS($B$8:$B23))),\"0\"))","v":""},{"$f":"IF($B23=\"\",\"\",IFERROR(INDEX('quantities report'!$D$2:$D$10003,SMALL(IF('quantities report'!$A$2:$A$10003=J$6,ROW('quantities report'!$A$2:$A$10003)-1,\"\"),ROWS($B$8:$B23))),\"0\"))","v":""},{"$f":"IF($B23=\"\",\"\",IFERROR(INDEX('quantities report'!$D$2:$D$10003,SMALL(IF('quantities report'!$A$2:$A$10003=K$6,ROW('quantities report'!$A$2:$A$10003)-1,\"\"),ROWS($B$8:$B23))),\"0\"))","v":""},{"$f":"IF($B23=\"\",\"\",IFERROR(INDEX('quantities report'!$D$2:$D$10003,SMALL(IF('quantities report'!$A$2:$A$10003=L$6,ROW('quantities report'!$A$2:$A$10003)-1,\"\"),ROWS($B$8:$B23))),\"0\"))","v":""},{"$f":"IF($B23=\"\",\"\",IFERROR(INDEX('quantities report'!$D$2:$D$10003,SMALL(IF('quantities report'!$A$2:$A$10003=M$6,ROW('quantities report'!$A$2:$A$10003)-1,\"\"),ROWS($B$8:$B23))),\"0\"))","v":""},{"$f":"IF($B23=\"\",\"\",IFERROR(INDEX('quantities report'!$D$2:$D$10003,SMALL(IF('quantities report'!$A$2:$A$10003=N$6,ROW('quantities report'!$A$2:$A$10003)-1,\"\"),ROWS($B$8:$B23))),\"0\"))","v":""},{"$f":"IF($B23=\"\",\"\",IFERROR(INDEX('quantities report'!$D$2:$D$10003,SMALL(IF('quantities report'!$A$2:$A$10003=O$6,ROW('quantities report'!$A$2:$A$10003)-1,\"\"),ROWS($B$8:$B23))),\"0\"))","v":""},"",{"$f":"IF($B23=\"\",\"\",IFERROR(INDEX('quantities report'!$D$2:$D$10003,SMALL(IF('quantities report'!$A$2:$A$10003=Q$6,ROW('quantities report'!$A$2:$A$10003)-1,\"\"),ROWS($B$8:$B23))),\"0\"))","v":""}]
[null,{"$f":"IFERROR(INDEX('manual inputs'!M:M,SMALL(IF('manual inputs'!M:M<>\"\",ROW('manual inputs'!M:M)),ROW(19:19))),\"\")","v":""},{"$f":"IF($B24=\"\",\"\",IFERROR(INDEX('quantities report'!$D$2:$D$10003,SMALL(IF('quantities report'!$A$2:$A$10003=C$6,ROW('quantities report'!$A$2:$A$10003)-1,\"\"),ROWS($B$8:$B24))),\"0\"))","v":""},{"$f":"IF($B24=\"\",\"\",IFERROR(INDEX('quantities report'!$D$2:$D$10003,SMALL(IF('quantities report'!$A$2:$A$10003=D$6,ROW('quantities report'!$A$2:$A$10003)-1,\"\"),ROWS($B$8:$B24))),\"0\"))","v":""},"",{"$f":"IF($B24=\"\",\"\",IFERROR(INDEX('quantities report'!$D$2:$D$10003,SMALL(IF('quantities report'!$A$2:$A$10003=F$6,ROW('quantities report'!$A$2:$A$10003)-1,\"\"),ROWS($B$8:$B24))),\"0\"))","v":""},{"$f":"IF($B24=\"\",\"\",IFERROR(INDEX('quantities report'!$D$2:$D$10003,SMALL(IF('quantities report'!$A$2:$A$10003=G$6,ROW('quantities report'!$A$2:$A$10003)-1,\"\"),ROWS($B$8:$B24))),\"0\"))","v":""},"",{"$f":"IF($B24=\"\",\"\",IFERROR(INDEX('quantities report'!$D$2:$D$10003,SMALL(IF('quantities report'!$A$2:$A$10003=I$6,ROW('quantities report'!$A$2:$A$10003)-1,\"\"),ROWS($B$8:$B24))),\"0\"))","v":""},{"$f":"IF($B24=\"\",\"\",IFERROR(INDEX('quantities report'!$D$2:$D$10003,SMALL(IF('quantities report'!$A$2:$A$10003=J$6,ROW('quantities report'!$A$2:$A$10003)-1,\"\"),ROWS($B$8:$B24))),\"0\"))","v":""},{"$f":"IF($B24=\"\",\"\",IFERROR(INDEX('quantities report'!$D$2:$D$10003,SMALL(IF('quantities report'!$A$2:$A$10003=K$6,ROW('quantities report'!$A$2:$A$10003)-1,\"\"),ROWS($B$8:$B24))),\"0\"))","v":""},{"$f":"IF($B24=\"\",\"\",IFERROR(INDEX('quantities report'!$D$2:$D$10003,SMALL(IF('quantities report'!$A$2:$A$10003=L$6,ROW('quantities report'!$A$2:$A$10003)-1,\"\"),ROWS($B$8:$B24))),\"0\"))","v":""},{"$f":"IF($B24=\"\",\"\",IFERROR(INDEX('quantities report'!$D$2:$D$10003,SMALL(IF('quantities report'!$A$2:$A$10003=M$6,ROW('quantities report'!$A$2:$A$10003)-1,\"\"),ROWS($B$8:$B24))),\"0\"))","v":""},{"$f":"IF($B24=\"\",\"\",IFERROR(INDEX('quantities report'!$D$2:$D$10003,SMALL(IF('quantities report'!$A$2:$A$10003=N$6,ROW('quantities report'!$A$2:$A$10003)-1,\"\"),ROWS($B$8:$B24))),\"0\"))","v":""},{"$f":"IF($B24=\"\",\"\",IFERROR(INDEX('quantities report'!$D$2:$D$10003,SMALL(IF('quantities report'!$A$2:$A$10003=O$6,ROW('quantities report'!$A$2:$A$10003)-1,\"\"),ROWS($B$8:$B24))),\"0\"))","v":""},"",{"$f":"IF($B24=\"\",\"\",IFERROR(INDEX('quantities report'!$D$2:$D$10003,SMALL(IF('quantities report'!$A$2:$A$10003=Q$6,ROW('quantities report'!$A$2:$A$10003)-1,\"\"),ROWS($B$8:$B24))),\"0\"))","v":""}]
[null,{"$f":"IFERROR(INDEX('manual inputs'!M:M,SMALL(IF('manual inputs'!M:M<>\"\",ROW('manual inputs'!M:M)),ROW(20:20))),\"\")","v":""},{"$f":"IF($B25=\"\",\"\",IFERROR(INDEX('quantities report'!$D$2:$D$10003,SMALL(IF('quantities report'!$A$2:$A$10003=C$6,ROW('quantities report'!$A$2:$A$10003)-1,\"\"),ROWS($B$8:$B25))),\"0\"))","v":""},{"$f":"IF($B25=\"\",\"\",IFERROR(INDEX('quantities report'!$D$2:$D$10003,SMALL(IF('quantities report'!$A$2:$A$10003=D$6,ROW('quantities report'!$A$2:$A$10003)-1,\"\"),ROWS($B$8:$B25))),\"0\"))","v":""},"",{"$f":"IF($B25=\"\",\"\",IFERROR(INDEX('quantities report'!$D$2:$D$10003,SMALL(IF('quantities report'!$A$2:$A$10003=F$6,ROW('quantities report'!$A$2:$A$10003)-1,\"\"),ROWS($B$8:$B25))),\"0\"))","v":""},{"$f":"IF($B25=\"\",\"\",IFERROR(INDEX('quantities report'!$D$2:$D$10003,SMALL(IF('quantities report'!$A$2:$A$10003=G$6,ROW('quantities report'!$A$2:$A$10003)-1,\"\"),ROWS($B$8:$B25))),\"0\"))","v":""},"",{"$f":"IF($B25=\"\",\"\",IFERROR(INDEX('quantities report'!$D$2:$D$10003,SMALL(IF('quantities report'!$A$2:$A$10003=I$6,ROW('quantities report'!$A$2:$A$10003)-1,\"\"),ROWS($B$8:$B25))),\"0\"))","v":""},{"$f":"IF($B25=\"\",\"\",IFERROR(INDEX('quantities report'!$D$2:$D$10003,SMALL(IF('quantities report'!$A$2:$A$10003=J$6,ROW('quantities report'!$A$2:$A$10003)-1,\"\"),ROWS($B$8:$B25))),\"0\"))","v":""},{"$f":"IF($B25=\"\",\"\",IFERROR(INDEX('quantities report'!$D$2:$D$10003,SMALL(IF('quantities report'!$A$2:$A$10003=K$6,ROW('quantities report'!$A$2:$A$10003)-1,\"\"),ROWS($B$8:$B25))),\"0\"))","v":""},{"$f":"IF($B25=\"\",\"\",IFERROR(INDEX('quantities report'!$D$2:$D$10003,SMALL(IF('quantities report'!$A$2:$A$10003=L$6,ROW('quantities report'!$A$2:$A$10003)-1,\"\"),ROWS($B$8:$B25))),\"0\"))","v":""},{"$f":"IF($B25=\"\",\"\",IFERROR(INDEX('quantities report'!$D$2:$D$10003,SMALL(IF('quantities report'!$A$2:$A$10003=M$6,ROW('quantities report'!$A$2:$A$10003)-1,\"\"),ROWS($B$8:$B25))),\"0\"))","v":""},{"$f":"IF($B25=\"\",\"\",IFERROR(INDEX('quantities report'!$D$2:$D$10003,SMALL(IF('quantities report'!$A$2:$A$10003=N$6,ROW('quantities report'!$A$2:$A$10003)-1,\"\"),ROWS($B$8:$B25))),\"0\"))","v":""},{"$f":"IF($B25=\"\",\"\",IFERROR(INDEX('quantities report'!$D$2:$D$10003,SMALL(IF('quantities report'!$A$2:$A$10003=O$6,ROW('quantities report'!$A$2:$A$10003)-1,\"\"),ROWS($B$8:$B25))),\"0\"))","v":""},"",{"$f":"IF($B25=\"\",\"\",IFERROR(INDEX('quantities report'!$D$2:$D$10003,SMALL(IF('quantities report'!$A$2:$A$10003=Q$6,ROW('quantities report'!$A$2:$A$10003)-1,\"\"),ROWS($B$8:$B25))),\"0\"))","v":""}]
[null,{"$f":"IFERROR(INDEX('manual inputs'!M:M,SMALL(IF('manual inputs'!M:M<>\"\",ROW('manual inputs'!M:M)),ROW(21:21))),\"\")","v":""},{"$f":"IF($B26=\"\",\"\",IFERROR(INDEX('quantities report'!$D$2:$D$10003,SMALL(IF('quantities report'!$A$2:$A$10003=C$6,ROW('quantities report'!$A$2:$A$10003)-1,\"\"),ROWS($B$8:$B26))),\"0\"))","v":""},{"$f":"IF($B26=\"\",\"\",IFERROR(INDEX('quantities report'!$D$2:$D$10003,SMALL(IF('quantities report'!$A$2:$A$10003=D$6,ROW('quantities report'!$A$2:$A$10003)-1,\"\"),ROWS($B$8:$B26))),\"0\"))","v":""},"",{"$f":"IF($B26=\"\",\"\",IFERROR(INDEX('quantities report'!$D$2:$D$10003,SMALL(IF('quantities report'!$A$2:$A$10003=F$6,ROW('quantities report'!$A$2:$A$10003)-1,\"\"),ROWS($B$8:$B26))),\"0\"))","v":""},{"$f":"IF($B26=\"\",\"\",IFERROR(INDEX('quantities report'!$D$2:$D$10003,SMALL(IF('quantities report'!$A$2:$A$10003=G$6,ROW('quantities report'!$A$2:$A$10003)-1,\"\"),ROWS($B$8:$B26))),\"0\"))","v":""},"",{"$f":"IF($B26=\"\",\"\",IFERROR(INDEX('quantities report'!$D$2:$D$10003,SMALL(IF('quantities report'!$A$2:$A$10003=I$6,ROW('quantities report'!$A$2:$A$10003)-1,\"\"),ROWS($B$8:$B26))),\"0\"))","v":""},{"$f":"IF($B26=\"\",\"\",IFERROR(INDEX('quantities report'!$D$2:$D$10003,SMALL(IF('quantities report'!$A$2:$A$10003=J$6,ROW('quantities report'!$A$2:$A$10003)-1,\"\"),ROWS($B$8:$B26))),\"0\"))","v":""},{"$f":"IF($B26=\"\",\"\",IFERROR(INDEX('quantities report'!$D$2:$D$10003,SMALL(IF('quantities report'!$A$2:$A$10003=K$6,ROW('quantities report'!$A$2:$A$10003)-1,\"\"),ROWS($B$8:$B26))),\"0\"))","v":""},{"$f":"IF($B26=\"\",\"\",IFERROR(INDEX('quantities report'!$D$2:$D$10003,SMALL(IF('quantities report'!$A$2:$A$10003=L$6,ROW('quantities report'!$A$2:$A$10003)-1,\"\"),ROWS($B$8:$B26))),\"0\"))","v":""},{"$f":"IF($B26=\"\",\"\",IFERROR(INDEX('quantities report'!$D$2:$D$10003,SMALL(IF('quantities report'!$A$2:$A$10003=M$6,ROW('quantities report'!$A$2:$A$10003)-1,\"\"),ROWS($B$8:$B26))),\"0\"))","v":""},{"$f":"IF($B26=\"\",\"\",IFERROR(INDEX('quantities report'!$D$2:$D$10003,SMALL(IF('quantities report'!$A$2:$A$10003=N$6,ROW('quantities report'!$A$2:$A$10003)-1,\"\"),ROWS($B$8:$B26))),\"0\"))","v":""},{"$f":"IF($B26=\"\",\"\",IFERROR(INDEX('quantities report'!$D$2:$D$10003,SMALL(IF('quantities report'!$A$2:$A$10003=O$6,ROW('quantities report'!$A$2:$A$10003)-1,\"\"),ROWS($B$8:$B26))),\"0\"))","v":""},"",{"$f":"IF($B26=\"\",\"\",IFERROR(INDEX('quantities report'!$D$2:$D$10003,SMALL(IF('quantities report'!$A$2:$A$10003=Q$6,ROW('quantities report'!$A$2:$A$10003)-1,\"\"),ROWS($B$8:$B26))),\"0\"))","v":""}]
[null,{"$f":"IFERROR(INDEX('manual inputs'!M:M,SMALL(IF('manual inputs'!M:M<>\"\",ROW('manual inputs'!M:M)),ROW(22:22))),\"\")","v":""},{"$f":"IF($B27=\"\",\"\",IFERROR(INDEX('quantities report'!$D$2:$D$10003,SMALL(IF('quantities report'!$A$2:$A$10003=C$6,ROW('quantities report'!$A$2:$A$10003)-1,\"\"),ROWS($B$8:$B27))),\"0\"))","v":""},{"$f":"IF($B27=\"\",\"\",IFERROR(INDEX('quantities report'!$D$2:$D$10003,SMALL(IF('quantities report'!$A$2:$A$10003=D$6,ROW('quantities report'!$A$2:$A$10003)-1,\"\"),ROWS($B$8:$B27))),\"0\"))","v":""},"",{"$f":"IF($B27=\"\",\"\",IFERROR(INDEX('quantities report'!$D$2:$D$10003,SMALL(IF('quantities report'!$A$2:$A$10003=F$6,ROW('quantities report'!$A$2:$A$10003)-1,\"\"),ROWS($B$8:$B27))),\"0\"))","v":""},{"$f":"IF($B27=\"\",\"\",IFERROR(INDEX('quantities report'!$D$2:$D$10003,SMALL(IF('quantities report'!$A$2:$A$10003=G$6,ROW('quantities report'!$A$2:$A$10003)-1,\"\"),ROWS($B$8:$B27))),\"0\"))","v":""},"",{"$f":"IF($B27=\"\",\"\",IFERROR(INDEX('quantities report'!$D$2:$D$10003,SMALL(IF('quantities report'!$A$2:$A$10003=I$6,ROW('quantities report'!$A$2:$A$10003)-1,\"\"),ROWS($B$8:$B27))),\"0\"))","v":""},{"$f":"IF($B27=\"\",\"\",IFERROR(INDEX('quantities report'!$D$2:$D$10003,SMALL(IF('quantities report'!$A$2:$A$10003=J$6,ROW('quantities report'!$A$2:$A$10003)-1,\"\"),ROWS($B$8:$B27))),\"0\"))","v":""},{"$f":"IF($B27=\"\",\"\",IFERROR(INDEX('quantities report'!$D$2:$D$10003,SMALL(IF('quantities report'!$A$2:$A$10003=K$6,ROW('quantities report'!$A$2:$A$10003)-1,\"\"),ROWS($B$8:$B27))),\"0\"))","v":""},{"$f":"IF($B27=\"\",\"\",IFERROR(INDEX('quantities report'!$D$2:$D$10003,SMALL(IF('quantities report'!$A$2:$A$10003=L$6,ROW('quantities report'!$A$2:$A$10003)-1,\"\"),ROWS($B$8:$B27))),\"0\"))","v":""},{"$f":"IF($B27=\"\",\"\",IFERROR(INDEX('quantities report'!$D$2:$D$10003,SMALL(IF('quantities report'!$A$2:$A$10003=M$6,ROW('quantities report'!$A$2:$A$10003)-1,\"\"),ROWS($B$8:$B27))),\"0\"))","v":""},{"$f":"IF($B27=\"\",\"\",IFERROR(INDEX('quantities report'!$D$2:$D$10003,SMALL(IF('quantities report'!$A$2:$A$10003=N$6,ROW('quantities report'!$A$2:$A$10003)-1,\"\"),ROWS($B$8:$B27))),\"0\"))","v":""},{"$f":"IF($B27=\"\",\"\",IFERROR(INDEX('quantities report'!$D$2:$D$10003,SMALL(IF('quantities report'!$A$2:$A$10003=O$6,ROW('quantities report'!$A$2:$A$10003)-1,\"\"),ROWS($B$8:$B27))),\"0\"))","v":""},"",{"$f":"IF($B27=\"\",\"\",IFERROR(INDEX('quantities report'!$D$2:$D$10003,SMALL(IF('quantities report'!$A$2:$A$10003=Q$6,ROW('quantities report'!$A$2:$A$10003)-1,\"\"),ROWS($B$8:$B27))),\"0\"))","v":""}]
[null,{"$f":"IFERROR(INDEX('manual inputs'!M:M,SMALL(IF('manual inputs'!M:M<>\"\",ROW('manual inputs'!M:M)),ROW(23:23))),\"\")","v":""},{"$f":"IF($B28=\"\",\"\",IFERROR(INDEX('quantities report'!$D$2:$D$10003,SMALL(IF('quantities report'!$A$2:$A$10003=C$6,ROW('quantities report'!$A$2:$A$10003)-1,\"\"),ROWS($B$8:$B28))),\"0\"))","v":""},{"$f":"IF($B28=\"\",\"\",IFERROR(INDEX('quantities report'!$D$2:$D$10003,SMALL(IF('quantities report'!$A$2:$A$10003=D$6,ROW('quantities report'!$A$2:$A$10003)-1,\"\"),ROWS($B$8:$B28))),\"0\"))","v":""},"",{"$f":"IF($B28=\"\",\"\",IFERROR(INDEX('quantities report'!$D$2:$D$10003,SMALL(IF('quantities report'!$A$2:$A$10003=F$6,ROW('quantities report'!$A$2:$A$10003)-1,\"\"),ROWS($B$8:$B28))),\"0\"))","v":""},{"$f":"IF($B28=\"\",\"\",IFERROR(INDEX('quantities report'!$D$2:$D$10003,SMALL(IF('quantities report'!$A$2:$A$10003=G$6,ROW('quantities report'!$A$2:$A$10003)-1,\"\"),ROWS($B$8:$B28))),\"0\"))","v":""},"",{"$f":"IF($B28=\"\",\"\",IFERROR(INDEX('quantities report'!$D$2:$D$10003,SMALL(IF('quantities report'!$A$2:$A$10003=I$6,ROW('quantities report'!$A$2:$A$10003)-1,\"\"),ROWS($B$8:$B28))),\"0\"))","v":""},{"$f":"IF($B28=\"\",\"\",IFERROR(INDEX('quantities report'!$D$2:$D$10003,SMALL(IF('quantities report'!$A$2:$A$10003=J$6,ROW('quantities report'!$A$2:$A$10003)-1,\"\"),ROWS($B$8:$B28))),\"0\"))","v":""},{"$f":"IF($B28=\"\",\"\",IFERROR(INDEX('quantities report'!$D$2:$D$10003,SMALL(IF('quantities report'!$A$2:$A$10003=K$6,ROW('quantities report'!$A$2:$A$10003)-1,\"\"),ROWS($B$8:$B28))),\"0\"))","v":""},{"$f":"IF($B28=\"\",\"\",IFERROR(INDEX('quantities report'!$D$2:$D$10003,SMALL(IF('quantities report'!$A$2:$A$10003=L$6,ROW('quantities report'!$A$2:$A$10003)-1,\"\"),ROWS($B$8:$B28))),\"0\"))","v":""},{"$f":"IF($B28=\"\",\"\",IFERROR(INDEX('quantities report'!$D$2:$D$10003,SMALL(IF('quantities report'!$A$2:$A$10003=M$6,ROW('quantities report'!$A$2:$A$10003)-1,\"\"),ROWS($B$8:$B28))),\"0\"))","v":""},{"$f":"IF($B28=\"\",\"\",IFERROR(INDEX('quantities report'!$D$2:$D$10003,SMALL(IF('quantities report'!$A$2:$A$10003=N$6,ROW('quantities report'!$A$2:$A$10003)-1,\"\"),ROWS($B$8:$B28))),\"0\"))","v":""},{"$f":"IF($B28=\"\",\"\",IFERROR(INDEX('quantities report'!$D$2:$D$10003,SMALL(IF('quantities report'!$A$2:$A$10003=O$6,ROW('quantities report'!$A$2:$A$10003)-1,\"\"),ROWS($B$8:$B28))),\"0\"))","v":""},"",{"$f":"IF($B28=\"\",\"\",IFERROR(INDEX('quantities report'!$D$2:$D$10003,SMALL(IF('quantities report'!$A$2:$A$10003=Q$6,ROW('quantities report'!$A$2:$A$10003)-1,\"\"),ROWS($B$8:$B28))),\"0\"))","v":""}]
[null,{"$f":"IFERROR(INDEX('manual inputs'!M:M,SMALL(IF('manual inputs'!M:M<>\"\",ROW('manual inputs'!M:M)),ROW(24:24))),\"\")","v":""},{"$f":"IF($B29=\"\",\"\",IFERROR(INDEX('quantities report'!$D$2:$D$10003,SMALL(IF('quantities report'!$A$2:$A$10003=C$6,ROW('quantities report'!$A$2:$A$10003)-1,\"\"),ROWS($B$8:$B29))),\"0\"))","v":""},{"$f":"IF($B29=\"\",\"\",IFERROR(INDEX('quantities report'!$D$2:$D$10003,SMALL(IF('quantities report'!$A$2:$A$10003=D$6,ROW('quantities report'!$A$2:$A$10003)-1,\"\"),ROWS($B$8:$B29))),\"0\"))","v":""},"",{"$f":"IF($B29=\"\",\"\",IFERROR(INDEX('quantities report'!$D$2:$D$10003,SMALL(IF('quantities report'!$A$2:$A$10003=F$6,ROW('quantities report'!$A$2:$A$10003)-1,\"\"),ROWS($B$8:$B29))),\"0\"))","v":""},{"$f":"IF($B29=\"\",\"\",IFERROR(INDEX('quantities report'!$D$2:$D$10003,SMALL(IF('quantities report'!$A$2:$A$10003=G$6,ROW('quantities report'!$A$2:$A$10003)-1,\"\"),ROWS($B$8:$B29))),\"0\"))","v":""},"",{"$f":"IF($B29=\"\",\"\",IFERROR(INDEX('quantities report'!$D$2:$D$10003,SMALL(IF('quantities report'!$A$2:$A$10003=I$6,ROW('quantities report'!$A$2:$A$10003)-1,\"\"),ROWS($B$8:$B29))),\"0\"))","v":""},{"$f":"IF($B29=\"\",\"\",IFERROR(INDEX('quantities report'!$D$2:$D$10003,SMALL(IF('quantities report'!$A$2:$A$10003=J$6,ROW('quantities report'!$A$2:$A$10003)-1,\"\"),ROWS($B$8:$B29))),\"0\"))","v":""},{"$f":"IF($B29=\"\",\"\",IFERROR(INDEX('quantities report'!$D$2:$D$10003,SMALL(IF('quantities report'!$A$2:$A$10003=K$6,ROW('quantities report'!$A$2:$A$10003)-1,\"\"),ROWS($B$8:$B29))),\"0\"))","v":""},{"$f":"IF($B29=\"\",\"\",IFERROR(INDEX('quantities report'!$D$2:$D$10003,SMALL(IF('quantities report'!$A$2:$A$10003=L$6,ROW('quantities report'!$A$2:$A$10003)-1,\"\"),ROWS($B$8:$B29))),\"0\"))","v":""},{"$f":"IF($B29=\"\",\"\",IFERROR(INDEX('quantities report'!$D$2:$D$10003,SMALL(IF('quantities report'!$A$2:$A$10003=M$6,ROW('quantities report'!$A$2:$A$10003)-1,\"\"),ROWS($B$8:$B29))),\"0\"))","v":""},{"$f":"IF($B29=\"\",\"\",IFERROR(INDEX('quantities report'!$D$2:$D$10003,SMALL(IF('quantities report'!$A$2:$A$10003=N$6,ROW('quantities report'!$A$2:$A$10003)-1,\"\"),ROWS($B$8:$B29))),\"0\"))","v":""},{"$f":"IF($B29=\"\",\"\",IFERROR(INDEX('quantities report'!$D$2:$D$10003,SMALL(IF('quantities report'!$A$2:$A$10003=O$6,ROW('quantities report'!$A$2:$A$10003)-1,\"\"),ROWS($B$8:$B29))),\"0\"))","v":""},"",{"$f":"IF($B29=\"\",\"\",IFERROR(INDEX('quantities report'!$D$2:$D$10003,SMALL(IF('quantities report'!$A$2:$A$10003=Q$6,ROW('quantities report'!$A$2:$A$10003)-1,\"\"),ROWS($B$8:$B29))),\"0\"))","v":""}]
[null,{"$f":"IFERROR(INDEX('manual inputs'!M:M,SMALL(IF('manual inputs'!M:M<>\"\",ROW('manual inputs'!M:M)),ROW(25:25))),\"\")","v":""},{"$f":"IF($B30=\"\",\"\",IFERROR(INDEX('quantities report'!$D$2:$D$10003,SMALL(IF('quantities report'!$A$2:$A$10003=C$6,ROW('quantities report'!$A$2:$A$10003)-1,\"\"),ROWS($B$8:$B30))),\"0\"))","v":""},{"$f":"IF($B30=\"\",\"\",IFERROR(INDEX('quantities report'!$D$2:$D$10003,SMALL(IF('quantities report'!$A$2:$A$10003=D$6,ROW('quantities report'!$A$2:$A$10003)-1,\"\"),ROWS($B$8:$B30))),\"0\"))","v":""},"",{"$f":"IF($B30=\"\",\"\",IFERROR(INDEX('quantities report'!$D$2:$D$10003,SMALL(IF('quantities report'!$A$2:$A$10003=F$6,ROW('quantities report'!$A$2:$A$10003)-1,\"\"),ROWS($B$8:$B30))),\"0\"))","v":""},{"$f":"IF($B30=\"\",\"\",IFERROR(INDEX('quantities report'!$D$2:$D$10003,SMALL(IF('quantities report'!$A$2:$A$10003=G$6,ROW('quantities report'!$A$2:$A$10003)-1,\"\"),ROWS($B$8:$B30))),\"0\"))","v":""},"",{"$f":"IF($B30=\"\",\"\",IFERROR(INDEX('quantities report'!$D$2:$D$10003,SMALL(IF('quantities report'!$A$2:$A$10003=I$6,ROW('quantities report'!$A$2:$A$10003)-1,\"\"),ROWS($B$8:$B30))),\"0\"))","v":""},{"$f":"IF($B30=\"\",\"\",IFERROR(INDEX('quantities report'!$D$2:$D$10003,SMALL(IF('quantities report'!$A$2:$A$10003=J$6,ROW('quantities report'!$A$2:$A$10003)-1,\"\"),ROWS($B$8:$B30))),\"0\"))","v":""},{"$f":"IF($B30=\"\",\"\",IFERROR(INDEX('quantities report'!$D$2:$D$10003,SMALL(IF('quantities report'!$A$2:$A$10003=K$6,ROW('quantities report'!$A$2:$A$10003)-1,\"\"),ROWS($B$8:$B30))),\"0\"))","v":""},{"$f":"IF($B30=\"\",\"\",IFERROR(INDEX('quantities report'!$D$2:$D$10003,SMALL(IF('quantities report'!$A$2:$A$10003=L$6,ROW('quantities report'!$A$2:$A$10003)-1,\"\"),ROWS($B$8:$B30))),\"0\"))","v":""},{"$f":"IF($B30=\"\",\"\",IFERROR(INDEX('quantities report'!$D$2:$D$10003,SMALL(IF('quantities report'!$A$2:$A$10003=M$6,ROW('quantities report'!$A$2:$A$10003)-1,\"\"),ROWS($B$8:$B30))),\"0\"))","v":""},{"$f":"IF($B30=\"\",\"\",IFERROR(INDEX('quantities report'!$D$2:$D$10003,SMALL(IF('quantities report'!$A$2:$A$10003=N$6,ROW('quantities report'!$A$2:$A$10003)-1,\"\"),ROWS($B$8:$B30))),\"0\"))","v":""},{"$f":"IF($B30=\"\",\"\",IFERROR(INDEX('quantities report'!$D$2:$D$10003,SMALL(IF('quantities report'!$A$2:$A$10003=O$6,ROW('quantities report'!$A$2:$A$10003)-1,\"\"),ROWS($B$8:$B30))),\"0\"))","v":""},"",{"$f":"IF($B30=\"\",\"\",IFERROR(INDEX('quantities report'!$D$2:$D$10003,SMALL(IF('quantities report'!$A$2:$A$10003=Q$6,ROW('quantities report'!$A$2:$A$10003)-1,\"\"),ROWS($B$8:$B30))),\"0\"))","v":""}]
[null,{"$f":"IFERROR(INDEX('manual inputs'!M:M,SMALL(IF('manual inputs'!M:M<>\"\",ROW('manual inputs'!M:M)),ROW(27:27))),\"\")","v":""},{"$f":"IF($B31=\"\",\"\",IFERROR(INDEX('quantities report'!$D$2:$D$10003,SMALL(IF('quantities report'!$A$2:$A$10003=C$6,ROW('quantities report'!$A$2:$A$10003)-1,\"\"),ROWS($B$8:$B31))),\"0\"))","v":""},{"$f":"IF($B31=\"\",\"\",IFERROR(INDEX('quantities report'!$D$2:$D$10003,SMALL(IF('quantities report'!$A$2:$A$10003=D$6,ROW('quantities report'!$A$2:$A$10003)-1,\"\"),ROWS($B$8:$B31))),\"0\"))","v":""},"",{"$f":"IF($B31=\"\",\"\",IFERROR(INDEX('quantities report'!$D$2:$D$10003,SMALL(IF('quantities report'!$A$2:$A$10003=F$6,ROW('quantities report'!$A$2:$A$10003)-1,\"\"),ROWS($B$8:$B31))),\"0\"))","v":""},{"$f":"IF($B31=\"\",\"\",IFERROR(INDEX('quantities report'!$D$2:$D$10003,SMALL(IF('quantities report'!$A$2:$A$10003=G$6,ROW('quantities report'!$A$2:$A$10003)-1,\"\"),ROWS($B$8:$B31))),\"0\"))","v":""},"",{"$f":"IF($B31=\"\",\"\",IFERROR(INDEX('quantities report'!$D$2:$D$10003,SMALL(IF('quantities report'!$A$2:$A$10003=I$6,ROW('quantities report'!$A$2:$A$10003)-1,\"\"),ROWS($B$8:$B31))),\"0\"))","v":""},{"$f":"IF($B31=\"\",\"\",IFERROR(INDEX('quantities report'!$D$2:$D$10003,SMALL(IF('quantities report'!$A$2:$A$10003=J$6,ROW('quantities report'!$A$2:$A$10003)-1,\"\"),ROWS($B$8:$B31))),\"0\"))","v":""},{"$f":"IF($B31=\"\",\"\",IFERROR(INDEX('quantities report'!$D$2:$D$10003,SMALL(IF('quantities report'!$A$2:$A$10003=K$6,ROW('quantities report'!$A$2:$A$10003)-1,\"\"),ROWS($B$8:$B31))),\"0\"))","v":""},{"$f":"IF($B31=\"\",\"\",IFERROR(INDEX('quantities report'!$D$2:$D$10003,SMALL(IF('quantities report'!$A$2:$A$10003=L$6,ROW('quantities report'!$A$2:$A$10003)-1,\"\"),ROWS($B$8:$B31))),\"0\"))","v":""},{"$f":"IF($B31=\"\",\"\",IFERROR(INDEX('quantities report'!$D$2:$D$10003,SMALL(IF('quantities report'!$A$2:$A$10003=M$6,ROW('quantities report'!$A$2:$A$10003)-1,\"\"),ROWS($B$8:$B31))),\"0\"))","v":""},{"$f":"IF($B31=\"\",\"\",IFERROR(INDEX('quantities report'!$D$2:$D$10003,SMALL(IF('quantities report'!$A$2:$A$10003=N$6,ROW('quantities report'!$A$2:$A$10003)-1,\"\"),ROWS($B$8:$B31))),\"0\"))","v":""},{"$f":"IF($B31=\"\",\"\",IFERROR(INDEX('quantities report'!$D$2:$D$10003,SMALL(IF('quantities report'!$A$2:$A$10003=O$6,ROW('quantities report'!$A$2:$A$10003)-1,\"\"),ROWS($B$8:$B31))),\"0\"))","v":""},"",{"$f":"IF($B31=\"\",\"\",IFERROR(INDEX('quantities report'!$D$2:$D$10003,SMALL(IF('quantities report'!$A$2:$A$10003=Q$6,ROW('quantities report'!$A$2:$A$10003)-1,\"\"),ROWS($B$8:$B31))),\"0\"))","v":""}]
[null,{"$f":"IFERROR(INDEX(#REF!,SMALL(IF(#REF!<>\"\",ROW(#REF!)),ROW(27:27))),\"\")","v":""}]

{"sheet":"calc wrksht-rdwy exc pay item","index":8,"n_rows":52,"n_cols":5,"rows_kept":52,"cut":false,"hidden":false,"merged":[[1,1,1,4]]}
[]
[null,"EARTHWORK SUMMARY\nUSING ROADWAY EXCAVATION AND EITHER BORROW OR WASTE PAY ITEMS"]
[]
[null,"EXCAVATION (unadjusted volumes)"]
[null,null,"Total Roadway Prism Excavation =",{"$f":"SUM(Grading!D3)+SUM(Grading_secondary!D3)","v":0},"CUYD"]
[null,null,"Total Approach Road Prism Excavation =",{"$f":"Grading!E3+Grading_secondary!E3","v":0},"CUYD"]
[null,null,"Total Pay Item 20401-0000 Roadway Excavation =",{"$f":"SUM(D5:D6)","v":0},"CUYD"]
[]
[null,"EXCAVATION MATERIAL AVAILABLE FOR FILL (unadjusted volumes)"]
[null,null,"Total Structure Excavation (walls) =",{"$f":"Grading!G3+Grading_secondary!G3","v":0},"CUYD"]
[null,null,"Total Excavation from Roadway Obliteration = ",{"$f":"Grading!H3+Grading_secondary!H3","v":0},"CUYD"]
[null,null,"Total Subexcavation =",{"$f":"Grading!I3+Grading_secondary!I3","v":0},"CUYD"]
[null,null,"Total =",{"$f":"SUM(D10:D12)","v":0},"CUYD"]
[]
[null,"EXCAVATION MATERIAL UNAVAILABLE FOR FILL (unadjusted volumes)"]
[null,null,"Total Pavement Removal in Cuts =",{"$f":"Grading!J3+Grading_secondary!J3","v":0},"CUYD"]
[null,null,"Total Topsoil Stripping in Cuts =",{"$f":"Grading!K3+Grading_secondary!K3","v":0},"CUYD"]
[null,null,"Total Waste Subexcavation =",{"$f":"Grading!L3+Grading_secondary!L3","v":0},"CUYD"]
[null,null,"Total =",{"$f":"SUM(D16:D18)","v":0},"CUYD"]
[]
[null,"TOTAL EXCAVATION AVAILABLE FOR FILLS (adjusted volume)"]
[null,null,"Total Volume After Adjustments Applied (Including Shrink/Swell) =",{"$f":"Grading!N3+Grading_secondary!N3","v":0},"CUYD"]
[]
[null,"EMBANKMENT (unadjusted volumes)"]
[null,null,"Total Roadway Prism Fill =",{"$f":"Grading!P3+Grading_secondary!P3","v":0},"CUYD"]
[null,null,"Total Approach Road Prism Fill =",{"$f":"Grading!Q3+Grading_secondary!Q3","v":0},"CUYD"]
[null,null,"Total =",{"$f":"SUM(D25:D26)","v":0},"CUYD"]
[]
[null,"VARIOUS ADDITIONAL BACKFILL MATERIAL NEEDED ONSITE"]
[null,null,"Total Various Types of Wall Backfill Material =",{"$f":"SUM(Grading!S3:Z3)+SUM(Grading_secondary!S3:Z3)","v":0},"CUYD"]
[null,null,"Total Backfill for Pavement Removal Under Fill =",{"$f":"Grading!AA3+Grading_secondary!AA3","v":0},"CUYD"]
[null,null,"Total Topsoil Replacement Under Fill =",{"$f":"Grading!AB3+Grading_secondary!AB3","v":0},"CUYD"]
[null,null,"Total Volume for Riprap =",{"$f":"Grading!AE3+Grading_secondary!AE3","v":0},"CUYD"]
[null,null,"Total Volume for Special Rock Embankment =",{"$f":"Grading!AF3+Grading_secondary!AF3","v":0},"CUYD"]
[null,null,"Total Embankment for Roadway Obliteration =",{"$f":"Grading!AG3+Grading_secondary!AG3","v":0},"CUYD"]
[null,null,"Total Subexcavation =",{"$f":"Grading!AC3+Grading_secondary!AC3","v":0},"CUYD"]
[null,null,"Total Volume for Topping or Select Topping =",{"$f":"Grading!AH3+Grading_secondary!AH3","v":0},"CUYD"]
[null,null,"Total Volume for Aggregate Base =",{"$f":"Grading!AD3+Grading_secondary!AD3","v":0},"CUYD"]
[null,null,"Total =",{"$f":"SUM(D30:D38)","v":0},"CUYD"]
[]
[null,"EXCAVATION MINUS EMBANKMENT"]
[null,null,"Total Estimated Excavation Available for Fills =",{"$f":"D22","v":0},"CUYD"]
[null,null,"Total Estimated Fill Material Required =",{"$f":"D27+D39","v":0},"CUYD"]
[null,null,"Excavation - Embankment = ",{"$f":"D42-D43","v":0},"CUYD"]
[]
[null,"WASTE"]
[null,null,"Estimated Total Pay Item 20441-0000 Waste =",{"$f":"IF(D44>0,D44,\"NA\")","v":"NA"},"CUYD"]
[]
[null,"BORROW"]
[null,null,"Estimated Unadjusted Volume of Unclassified Borrow Required =",{"$f":"IF(D44<0,ABS(D44), \"NA\" )","v":"NA"},"CUYD"]
[null,null,"Estimated Shrink / Swell at Borrow Pit Site =",0.9]
[null,null,"Estimated Total Pay Item 20403-0000 Unclassified Borrow  =",{"$f":"IF(D50=\"NA\",\"NA\",ABS((ROUNDUP(D50/D51,0))))","v":"NA"},"CUYD"]

{"sheet":"Grading Summary - rdwy exc","index":9,"n_rows":48,"n_cols":21,"rows_kept":48,"cut":false,"hidden":false,"merged":[[47,6,47,19],[42,20,42,27],[43,20,43,27],[28,0,28,1],[41,6,41,19],[41,20,41,29],[45,6,45,19],[46,6,46,19],[44,20,44,30],[28,4,28,6],[11,0,11,1],[12,0,12,1],[40,20,40,29],[7,9,11,9],[7,10,11,10],[7,11,11,11],[7,14,11,14],[7,15,11,15],[7,16,11,16],[7,19,11,19],[37,4,37,6],[40,6,40,19],[1,0,10,0],[1,1,10,1],[5,4,5,19],[6,4,6,6],[6,14,6,15],[7,4,12,6],[7,7,11,7],[7,8,11,8],[6,16,6,18],[7,17,11,17],[7,18,11,18],[6,12,6,13],[7,12,11,12],[7,13,11,13],[6,7,6,8],[6,10,6,11]]}
[]
["<---Type Beginning Row Number","<---Automatic calculates except for last row",null,null,"NOTE TO DESIGNER:  Adjust the Notes below the Grading Summary to fit your project."]
[]
[null,null,null,null,null,null,null,"Column D","Column E","Column F","Columns G,H,I","Columns J,K,L","Column M","Column N","Column P","Column Q","Columns S-AH","Column AI","Column AJ","Column AK or AO"]
[]
[null,null,null,null,"GRADING SUMMARY"]
[null,null,null,null,null,null,null,"Roadway Excavation",null,"Pay Item\n20401-0000","Additional Excavation\nFor info only",null,"For info only",null,"Embankment\nFor info only",null,"For info only",null,null,"For Info Only"]
[null,null,null,null,"Station to Station",null,null,"Prismoidal Volume","Approach\nRoads","ROADWAY EXCAVATION","(+)\nAvailable\nMaterial\n(see note 3)","(-)\nUnavailable\nMaterial\n(see note 4)","Shrink/Swell Factor","Total Excavation Avaliable For Fills","Prismoidal Volume","Approach\nRoads","(+)\nVarious\nAdditional Backfill\nMaterial\nNeeded\nOnsite\n(see note 5)","Total Embankment","Excavation-Embankment",{"$f":"IF('calc wrksht-rdwy exc pay item'!$D$47=\"NA\", \"UNCLASSIFIED BORROW\n(see note 6)\",\"WASTE\n(see note 6)\")","v":"UNCLASSIFIED BORROW\n(see note 6)"}]
[]
[]
[]
["Rows from"]
["Grading",null,null,null,null,null,null,"BCY","BCY","CUYD","BCY","BCY",null,"CCY","CCY","CCY","CCY","CCY","CCY","CUYD"]
[null,{"$f":"IF(A15=\"\",\"\",+A15)","v":""},null,null,{"$f":"IF(A14=\"\",\"\",INDIRECT(CONCATENATE($A$13,\"!\",\"B\",A14)))","v":""},{"$f":"IF(E14=\"\",\"\",\"-\")","v":""},{"$f":"IF(A14=\"\",\"\",INDIRECT(CONCATENATE($A$13,\"!\",\"b\",B14)))","v":""},{"$f":"IF(E14=\"\",\"\",ROUND(SUM(INDIRECT(CONCATENATE($A$13,\"!\",\"D\",$B14))),0))","v":""},{"$f":"IF(F14=\"\",\"\",ROUND(SUM(INDIRECT(CONCATENATE($A$13,\"!\",\"E\",$B14))),0))","v":""},{"$f":"IF(F14=\"\",\"\",ROUND(SUM(INDIRECT(CONCATENATE($A$13,\"!\",\"F\",$B14))),0))","v":""},{"$f":"IF(E14=\"\",\"\",ROUND(SUM(INDIRECT(CONCATENATE($A$13,\"!\",\"G\",$B14,\":\",\"I\",$B14))),0))","v":""},{"$f":"IF(E14=\"\",\"\",ROUND(SUM(INDIRECT(CONCATENATE($A$13,\"!\",\"J\",$B14,\":\",\"L\",$B14))),0))","v":""},{"$f":"IF(G14=\"\",\"\",ROUND(AVERAGE(INDIRECT(CONCATENATE($A$13,\"!\",\"M\",$B14))),2))","v":""},{"$f":"IF(H14=\"\",\"\",ROUND(SUM(INDIRECT(CONCATENATE($A$13,\"!\",\"n\",$B14))),0))","v":""},{"$f":"IF(F14=\"\",\"\",ROUND(SUM(INDIRECT(CONCATENATE($A$13,\"!\",\"p\",$B14))),0))","v":""},{"$f":"IF(F14=\"\",\"\",ROUND(SUM(INDIRECT(CONCATENATE($A$13,\"!\",\"Q\",$B14))),0))","v":""},{"$f":"IF(E14=\"\",\"\",ROUND(SUM(INDIRECT(CONCATENATE($A$13,\"!\",\"s\",$B14,\":\",\"Ah\",$B14))),0))","v":""},{"$f":"IF(G14=\"\",\"\",ROUND(SUM(INDIRECT(CONCATENATE($A$13,\"!\",\"Ai\",$B14))),0))","v":""},{"$f":"IF(H14=\"\",\"\",ROUND(SUM(INDIRECT(CONCATENATE($A$13,\"!\",\"AJ\",$B14))),0))","v":""}]
[null,{"$f":"IF(A16=\"\",\"\",+A16)","v":""},null,null,{"$f":"IF(A15=\"\",\"\",INDIRECT(CONCATENATE($A$13,\"!\",\"B\",A15)))","v":""},"",{"$f":"IF(A15=\"\",\"\",INDIRECT(CONCATENATE($A$13,\"!\",\"b\",B15)))","v":""},{"$f":"IF(E15=\"\",\"\",ROUND(SUM(INDIRECT(CONCATENATE($A$13,\"!\",\"D\",$B15))),0))","v":""},{"$f":"IF(F15=\"\",\"\",ROUND(SUM(INDIRECT(CONCATENATE($A$13,\"!\",\"E\",$B15))),0))","v":""},{"$f":"IF(F15=\"\",\"\",ROUND(SUM(INDIRECT(CONCATENATE($A$13,\"!\",\"F\",$B15))),0))","v":""},{"$f":"IF(E15=\"\",\"\",ROUND(SUM(INDIRECT(CONCATENATE($A$13,\"!\",\"G\",$B15,\":\",\"I\",$B15))),0))","v":""},{"$f":"IF(E15=\"\",\"\",ROUND(SUM(INDIRECT(CONCATENATE($A$13,\"!\",\"J\",$B15,\":\",\"L\",$B15))),0))","v":""},{"$f":"IF(G15=\"\",\"\",ROUND(AVERAGE(INDIRECT(CONCATENATE($A$13,\"!\",\"M\",$B15))),2))","v":""},{"$f":"IF(H15=\"\",\"\",ROUND(SUM(INDIRECT(CONCATENATE($A$13,\"!\",\"n\",$B15))),0))","v":""},{"$f":"IF(F15=\"\",\"\",ROUND(SUM(INDIRECT(CONCATENATE($A$13,\"!\",\"p\",$B15))),0))","v":""},{"$f":"IF(F15=\"\",\"\",ROUND(SUM(INDIRECT(CONCATENATE($A$13,\"!\",\"Q\",$B15))),0))","v":""},{"$f":"IF(E15=\"\",\"\",ROUND(SUM(INDIRECT(CONCATENATE($A$13,\"!\",\"s\",$B15,\":\",\"Ah\",$B15))),0))","v":""},{"$f":"IF(G15=\"\",\"\",ROUND(SUM(INDIRECT(CONCATENATE($A$13,\"!\",\"Ai\",$B15))),0))","v":""},{"$f":"IF(H15=\"\",\"\",ROUND(SUM(INDIRECT(CONCATENATE($A$13,\"!\",\"AJ\",$B15))),0))","v":""}]
[null,"",null,null,"","","","","","","","","","","","","","",""]
[null,{"$f":"IF(A18=\"\",\"\",+A18)","v":""},null,null,"","","","","","","","","","","","","","",""]
[null,"",null,null,"","","","","","","","","","","","","","",""]
[null,"",null,null,"","","","","","","","","","","","","","",""]
[null,"",null,null,"","","","","","","","","","","","","","",""]
[null,"",null,null,"","","","","","","","","","","","","","",""]
[null,"",null,null,"","","","","","","","","","","","","","",""]
[null,"",null,null,"","","","","","","","","","","","","","",""]
[null,"",null,null,"","","","","","","","","","","","","","",""]
[null,null,null,null,"","","","","","","","","","","","","","",""]
[null,"",null,null,"","","","","","","","","","","","","","",""]
[null,"",null,null,null,null,null,"","","","","","","","","","","",""]
[]
["Grading_Secondary",null,null,null,"Secondary Alignment"]
[null,{"$f":"IF(A31=\"\",\"\",+A31)","v":""},null,null,{"$f":"IF(A30=\"\",\"\",INDIRECT(CONCATENATE($A$29,\"!\",\"B\",A30)))","v":""},"",{"$f":"IF(A30=\"\",\"\",INDIRECT(CONCATENATE($A$29,\"!\",\"b\",B30)))","v":""},{"$f":"IF(E30=\"\",\"\",ROUND(SUM(INDIRECT(CONCATENATE($A$29,\"!\",\"D\",$B30))),0))","v":""},{"$f":"IF(F30=\"\",\"\",ROUND(SUM(INDIRECT(CONCATENATE($A$29,\"!\",\"E\",$B30))),0))","v":""},{"$f":"IF(F30=\"\",\"\",ROUND(SUM(INDIRECT(CONCATENATE($A$29,\"!\",\"F\",$B30))),0))","v":""},{"$f":"IF(E30=\"\",\"\",ROUND(SUM(INDIRECT(CONCATENATE($A$29,\"!\",\"G\",$B30,\":\",\"I\",$B30))),0))","v":""},{"$f":"IF(E30=\"\",\"\",ROUND(SUM(INDIRECT(CONCATENATE($A$29,\"!\",\"J\",$B30,\":\",\"L\",$B30))),0))","v":""},{"$f":"IF(G30=\"\",\"\",ROUND(AVERAGE(INDIRECT(CONCATENATE($A$29,\"!\",\"M\",$B30))),2))","v":""},{"$f":"IF(H30=\"\",\"\",ROUND(SUM(INDIRECT(CONCATENATE($A$29,\"!\",\"N\",$B30))),0))","v":""},{"$f":"IF(F30=\"\",\"\",ROUND(SUM(INDIRECT(CONCATENATE($A$29,\"!\",\"P\",$B30))),0))","v":""},{"$f":"IF(F30=\"\",\"\",ROUND(SUM(INDIRECT(CONCATENATE($A$29,\"!\",\"Q\",$B30))),0))","v":""},{"$f":"IF(E30=\"\",\"\",ROUND(SUM(INDIRECT(CONCATENATE($A$29,\"!\",\"S\",$B30,\":\",\"AH\",$B30))),0))","v":""},{"$f":"IF(G30=\"\",\"\",ROUND(SUM(INDIRECT(CONCATENATE($A$29,\"!\",\"aI\",$B30))),0))","v":""},{"$f":"IF(H30=\"\",\"\",ROUND(SUM(INDIRECT(CONCATENATE($A$29,\"!\",\"aj\",$B30))),0))","v":""}]
[null,"",null,null,{"$f":"IF(A31=\"\",\"\",INDIRECT(CONCATENATE($A$29,\"!\",\"B\",A31)))","v":""},{"$f":"IF(E31=\"\",\"\",\"-\")","v":""},{"$f":"IF(A31=\"\",\"\",INDIRECT(CONCATENATE($A$29,\"!\",\"b\",B31)))","v":""},{"$f":"IF(E31=\"\",\"\",ROUND(SUM(INDIRECT(CONCATENATE($A$29,\"!\",\"D\",$B31))),0))","v":""},{"$f":"IF(F31=\"\",\"\",ROUND(SUM(INDIRECT(CONCATENATE($A$29,\"!\",\"E\",$B31))),0))","v":""},{"$f":"IF(F31=\"\",\"\",ROUND(SUM(INDIRECT(CONCATENATE($A$29,\"!\",\"F\",$B31))),0))","v":""},{"$f":"IF(E31=\"\",\"\",ROUND(SUM(INDIRECT(CONCATENATE($A$29,\"!\",\"G\",$B31,\":\",\"I\",$B31))),0))","v":""},{"$f":"IF(E31=\"\",\"\",ROUND(SUM(INDIRECT(CONCATENATE($A$29,\"!\",\"J\",$B31,\":\",\"L\",$B31))),0))","v":""},{"$f":"IF(G31=\"\",\"\",ROUND(AVERAGE(INDIRECT(CONCATENATE($A$29,\"!\",\"M\",$B31))),2))","v":""},{"$f":"IF(H31=\"\",\"\",ROUND(SUM(INDIRECT(CONCATENATE($A$29,\"!\",\"N\",$B31))),0))","v":""},{"$f":"IF(F31=\"\",\"\",ROUND(SUM(INDIRECT(CONCATENATE($A$29,\"!\",\"P\",$B31))),0))","v":""},{"$f":"IF(F31=\"\",\"\",ROUND(SUM(INDIRECT(CONCATENATE($A$29,\"!\",\"Q\",$B31))),0))","v":""},{"$f":"IF(E31=\"\",\"\",ROUND(SUM(INDIRECT(CONCATENATE($A$29,\"!\",\"S\",$B31,\":\",\"AH\",$B31))),0))","v":""},{"$f":"IF(G31=\"\",\"\",ROUND(SUM(INDIRECT(CONCATENATE($A$29,\"!\",\"aI\",$B31))),0))","v":""},{"$f":"IF(H31=\"\",\"\",ROUND(SUM(INDIRECT(CONCATENATE($A$29,\"!\",\"aj\",$B31))),0))","v":""}]
[null,"",null,null,"","","","","","","","","","","","","","",""]
[null,"",null,null,"","","","","","","","","","","","","","",""]
[null,"",null,null,"","","","","","","","","","","","","","",""]
[null,"",null,null,"","","","","","","","","","","","","","",""]
[null,"",null,null,"","","","","","","","","","","","","","",""]
[null,""]
[null,"",null,null,"TOTALS",null,null,{"$f":"SUM(H14:H37)","v":0},0,0,0,0,null,0,0,0,0,0,0,{"$f":"IF($T$8=\"UNCLASSIFIED BORROW\n(see note 6)\",'calc wrksht-rdwy exc pay item'!$D$52,'calc wrksht-rdwy exc pay item'!$D$47)","v":"NA"}]
[null,{"$f":"IF(A40=\"\",\"\",+A40)","v":""}]
[null,{"$f":"IF(A41=\"\",\"\",+A41)","v":""},null,null,"NOTE:",null,null,null,null,null,null,null,null,null,null,null,null,null,null,null,"Notes to Designers"]
[null,{"$f":"IF(A42=\"\",\"\",+A42)","v":""},null,null,null,1,"Quantities based on prismoidal (surface to surface) volumes."]
[null,{"$f":"IF(A44=\"\",\"\",+A44)","v":""},null,null,null,2,"Conserve <<XXX>> inches of topsoil in cut and fill slope areas.  "]
[null,null,null,null,null,3,"Available material includes <<INSERT PROJECT SPECIFIC INFORMATION****>>.",null,null,null,null,null,null,null,null,null,null,null,null,null,"**** Material is anything in the grading tab in columns G, H and I"]
[null,null,null,null,null,4,"Unavailable material includes <<INSERT PROJECT SPECIFIC INFORMATION****>>.",null,null,null,null,null,null,null,null,null,null,null,null,null,"**** Material is anything in the grading tab in columns J, K and L"]
[null,null,null,null,null,5,"Various additional backfill material needed onsite includes <<INSERT PROJECT SPECIFIC INFORMATION****>>.",null,null,null,null,null,null,null,null,null,null,null,null,null,"**** Material is anything in the grading tab in columns S, T, U, V, W, X, Y, Z, AA, AB, AC, AD, AE, AF, AG and AH"]
[null,null,null,null,null,6,"Waste quantity calculated using volumes adjusted for shrink/swell. The average shrink/swell factor shown is computed by taking an average of recommended values over the specified range. Refer to the Geotech Report for recommended shrink/swell factors.\nOr\nUnclassified borrow quantity calculated using volumes adjusted for shrink/swell. An assumed value of 0.9 was used for calculations. The contractor is responsible for determining the shrink/swell on the borrow material."]
[null,null,null,null,null,7,"The quantities shown herein are approximations.  Payment will be made for the actual quantities of work performed."]
[null,null,null,null,null,8,"BCY = Bank cubic yard - one cubic yard of material as it lies in the natural state.\nCCY = Compacted cubic yard - one cubic yard of material after it has been compacted to specification density."]

{"sheet":"calc wrksht-emb const pay item","index":10,"n_rows":52,"n_cols":5,"rows_kept":52,"cut":false,"hidden":false,"merged":[[1,1,1,4]]}
[]
[null,"EARTHWORK SUMMARY\nUSING EMBANKMENT CONSTRUCTION PAY ITEM"]
[]
[null,"EXCAVATION (unadjusted volumes)"]
[null,null,"Total Roadway Prism Excavation =",{"$f":"SUM(Grading!D3)+SUM(Grading_secondary!D3)","v":0},"CUYD"]
[null,null,"Total Approach Road Prism Excavation =",{"$f":"Grading!E3+Grading_secondary!E3","v":0},"CUYD"]
[null,null,"Total =",{"$f":"SUM(D5:D6)","v":0},"CUYD"]
[]
[null,"EXCAVATION MATERIAL AVAILABLE FOR FILL (unadjusted volumes)"]
[null,null,"Total Structure Excavation (walls) =",{"$f":"Grading!G3+Grading_secondary!G3","v":0},"CUYD"]
[null,null,"Total Excavation from Roadway Obliteration = ",{"$f":"Grading!H3+Grading_secondary!H3","v":0},"CUYD"]
[null,null,"Total Subexcavation =",{"$f":"Grading!I3+Grading_secondary!I3","v":0},"CUYD"]
[null,null,"Total =",{"$f":"SUM(D10:D12)","v":0},"CUYD"]
[]
[null,"EXCAVATION MATERIAL UNAVAILABLE FOR FILL (unadjusted volumes)"]
[null,null,"Total Pavement Removal in Cuts =",{"$f":"Grading!J3+Grading_secondary!J3","v":0},"CUYD"]
[null,null,"Total Topsoil Stripping in Cuts =",{"$f":"Grading!K3+Grading_secondary!K3","v":0},"CUYD"]
[null,null,"Total Waste Subexcavation =",{"$f":"Grading!L3+Grading_secondary!L3","v":0},"CUYD"]
[null,null,"Total =",{"$f":"SUM(D16:D18)","v":0},"CUYD"]
[]
[null,"TOTAL EXCAVATION AVAILABLE FOR FILLS (adjusted volume)"]
[null,null,"Total Volume After Adjustments Applied (Including Shrink/Swell) =",{"$f":"Grading!N3+Grading_secondary!N3","v":0},"CUYD"]
[]
[null,"EMBANKMENT (unadjusted volumes)"]
[null,null,"Total Roadway Prism Fill =",{"$f":"Grading!P3+Grading_secondary!P3","v":0},"CUYD"]
[null,null,"Total Approach Road Prism Fill =",{"$f":"Grading!Q3+Grading_secondary!Q3","v":0},"CUYD"]
[null,null,"Total =",{"$f":"SUM(D25:D26)","v":0},"CUYD"]
[]
[null,"VARIOUS ADDITIONAL BACKFILL MATERIAL NEEDED ONSITE"]
[null,null,"Total Various Types of Wall Backfill Material =",{"$f":"SUM(Grading!S3:Z3)+SUM(Grading_secondary!T3:AA3)","v":0},"CUYD"]
[null,null,"Total Backfill for Pavement Removal Under Fill =",{"$f":"Grading!AA3+Grading_secondary!AA3","v":0},"CUYD"]
[null,null,"Total Topsoil Replacement Under Fill =",{"$f":"Grading!AB3+Grading_secondary!AB3","v":0},"CUYD"]
[null,null,"Total Volume for Riprap =",{"$f":"Grading!AE3+Grading_secondary!AE3","v":0},"CUYD"]
[null,null,"Total Volume for Special Rock Embankment =",{"$f":"Grading!AF3+Grading_secondary!AF3","v":0},"CUYD"]
[null,null,"Total Embankment for Roadway Obliteration =",{"$f":"Grading!AG3+Grading_secondary!AG3","v":0},"CUYD"]
[null,null,"Total Subexcavation =",{"$f":"Grading!AC3+Grading_secondary!AC3","v":0},"CUYD"]
[null,null,"Total Volume for Topping or Select Topping =",{"$f":"Grading!AH3+Grading_secondary!EAH3","v":0},"CUYD"]
[null,null,"Total Volume for Aggregate Base =",{"$f":"Grading!AD3+Grading_secondary!AD3","v":0},"CUYD"]
[null,null,"Total =",{"$f":"SUM(D30:D38)","v":0},"CUYD"]
[]
[null,"EXCAVATION MINUS EMBANKMENT"]
[null,null,"Total Estimated Excavation Available for Fills =",{"$f":"D22","v":0},"CUYD"]
[null,null,"Total Estimated Fill Material Required =",{"$f":"D27+D39","v":0},"CUYD"]
[null,null,"Excavation - Embankment = ",{"$f":"D42-D43","v":0},"CUYD"]
[]
[null,"EMBANKMENT CONSTRUCTION"]
[null,null,"Estimated Total Pay Item 20420-0000 Embankment Construction =",{"$f":"D27","v":0},"CUYD"]
[]
[null,"UNCLASSIFIED BORROW"]
[null,null,"Estimated Unadjusted Volume of Unclassified Borrow Required =",{"$f":"ABS(Grading!AM3+Grading_secondary!AM3)","v":0},"CUYD"]
[null,null,"Estimated Shrink / Swell at Borrow Pit Site =",{"$f":"Grading!AN3","v":0.8999999999999998}]
[null,null,"Estimated Quantity of Unclassified Borrow Required =",{"$f":"ABS(Grading!AO3++Grading_secondary!AO3)","v":0},"CUYD"]

{"sheet":"Grading Summary - emb const","index":11,"n_rows":54,"n_cols":23,"rows_kept":54,"cut":false,"hidden":false,"merged":[[6,12,6,13],[7,9,11,9],[7,10,11,10],[45,6,45,20],[11,0,11,1],[12,0,12,1],[37,4,37,6],[52,6,52,20],[7,11,11,11],[7,14,11,14],[7,15,11,15],[7,16,11,16],[7,4,12,6],[7,7,11,7],[7,20,11,20],[28,4,28,6],[1,0,10,0],[1,1,10,1],[5,4,5,20],[55,6,55,17],[56,6,56,20],[58,6,58,17],[53,6,53,17],[57,6,57,17],[46,6,46,19],[47,6,47,19],[53,22,53,31],[54,6,54,17],[54,22,54,31],[42,22,42,29],[43,22,43,29],[44,22,44,32],[6,17,6,19],[7,18,11,18],[7,19,11,19],[7,17,11,17],[40,6,40,19],[41,6,41,19],[7,8,11,8],[6,4,6,6],[6,7,6,9],[6,10,6,11],[6,14,6,15],[7,12,11,12],[7,13,11,13]]}
[]
["<---Type Beginning Row Number","<---Automatic calculates except for last row",null,null,"NOTE TO DESIGNER:  Adjust the Notes below the Grading Summary to fit your project."]
[]
[null,null,null,null,null,null,null,"Column D","Column E","Column F","Columns G,H,I","Columns J,K,L","Column M","Column N","Column P","Column Q","Column R","Columns S-AH","Column AI","Column AJ","Column AO"]
[]
[null,null,null,null,"GRADING SUMMARY"]
[null,null,null,null,null,null,null,"Roadway Excavation",null,null,"Additional Excavation\nFor info only",null,"For info only",null,"Embankment",null,"Pay Item\n20420-0000","For info only",null,null,"For info only"]
[null,null,null,null,"Station to Station",null,null,"Prismoidal Volume","Approach\nRoads","Roadway\nExcavation","(+)\nAvailable\nMaterial\n(see note 3)","(-)\nUnavailable\nMaterial\n(see note 4)","Shrink/Swell Factor","Total Excavation Available For Fills","Prismoidal Volume","Approach\nRoads","Embankment Construction","(+)\nVarious\nAdditional Backfill\nMaterial\nNeeded\nOnsite\n(see note 5)","Total Embankment","Excavation - Embankment","Estimated Unclassified Borrow Volume\n(see note 6)"]
[]
[]
[]
["Rows from"]
["Grading",null,null,null,null,null,null,"BCY","BCY","BCY","BCY","BCY",null,"CCY","CCY","CCY","CUYD","CCY","CCY","CCY","BCY"]
[null,{"$f":"IF(A15=\"\",\"\",+A15)","v":""},null,null,{"$f":"IF(B14=\"\",\"\",INDIRECT(CONCATENATE($A$13,\"!\",\"B\",A14)))","v":""},{"$f":"IF(E14=\"\",\"\",\"-\")","v":""},{"$f":"IF(A14=\"\",\"\",INDIRECT(CONCATENATE($A$13,\"!\",\"B\",B14)))","v":""},{"$f":"IF(E14=\"\",\"\",ROUND(SUM(INDIRECT(CONCATENATE($A$13,\"!\",\"D\",$B14))),0))","v":""},{"$f":"IF(F14=\"\",\"\",ROUND(SUM(INDIRECT(CONCATENATE($A$13,\"!\",\"E\",$B14))),0))","v":""},{"$f":"IF(F14=\"\",\"\",ROUND(SUM(INDIRECT(CONCATENATE($A$13,\"!\",\"F\",$B14))),0))","v":""},{"$f":"IF(E14=\"\",\"\",ROUND(SUM(INDIRECT(CONCATENATE($A$13,\"!\",\"G\",$A14,\":\",\"I\",$B14))),0))","v":""},{"$f":"IF(E14=\"\",\"\",ROUND(SUM(INDIRECT(CONCATENATE($A$13,\"!\",\"J\",$A14,\":\",\"L\",$B14))),0))","v":""},{"$f":"IF(G14=\"\",\"\",ROUND(AVERAGE(INDIRECT(CONCATENATE($A$13,\"!\",\"M\",$B14))),2))","v":""},{"$f":"IF(H14=\"\",\"\",ROUND(SUM(INDIRECT(CONCATENATE($A$13,\"!\",\"N\",$B14))),0))","v":""},{"$f":"IF(F14=\"\",\"\",ROUND(SUM(INDIRECT(CONCATENATE($A$13,\"!\",\"P\",$B14))),0))","v":""},{"$f":"IF(F14=\"\",\"\",ROUND(SUM(INDIRECT(CONCATENATE($A$13,\"!\",\"Q\",$B14))),0))","v":""},{"$f":"IF(G14=\"\",\"\",ROUND(SUM(INDIRECT(CONCATENATE($A$13,\"!\",\"R\",$B14))),0))","v":""},{"$f":"IF(F14=\"\",\"\",ROUND(SUM(INDIRECT(CONCATENATE($A$13,\"!\",\"S\",$A14,\":\",\"AH\",$B14))),0))","v":""},{"$f":"IF(H14=\"\",\"\",ROUND(SUM(INDIRECT(CONCATENATE($A$13,\"!\",\"AI\",$B14))),0))","v":""},{"$f":"IF(I14=\"\",\"\",ROUND(SUM(INDIRECT(CONCATENATE($A$13,\"!\",\"AJ\",$B14))),0))","v":""},{"$f":"IF(H14=\"\",\"\",ROUND(SUM(INDIRECT(CONCATENATE($A$13,\"!\",\"AO\",$B14))),0))","v":""}]
[null,{"$f":"IF(A16=\"\",\"\",+A16)","v":""},null,null,{"$f":"IF(A15=\"\",\"\",INDIRECT(CONCATENATE($A$13,\"!\",\"B\",A15)))","v":""},"",{"$f":"IF(A15=\"\",\"\",INDIRECT(CONCATENATE($A$13,\"!\",\"B\",B15)))","v":""},{"$f":"IF(E15=\"\",\"\",ROUND(SUM(INDIRECT(CONCATENATE($A$13,\"!\",\"D\",$B15))),0))","v":""},{"$f":"IF(F15=\"\",\"\",ROUND(SUM(INDIRECT(CONCATENATE($A$13,\"!\",\"E\",$B15))),0))","v":""},{"$f":"IF(F15=\"\",\"\",ROUND(SUM(INDIRECT(CONCATENATE($A$13,\"!\",\"F\",$B15))),0))","v":""},{"$f":"IF(E15=\"\",\"\",ROUND(SUM(INDIRECT(CONCATENATE($A$13,\"!\",\"G\",$B15,\":\",\"I\",$B15))),0))","v":""},{"$f":"IF(E15=\"\",\"\",ROUND(SUM(INDIRECT(CONCATENATE($A$13,\"!\",\"J\",$B15,\":\",\"L\",$B15))),0))","v":""},{"$f":"IF(G15=\"\",\"\",ROUND(AVERAGE(INDIRECT(CONCATENATE($A$13,\"!\",\"M\",$B15))),2))","v":""},{"$f":"IF(H15=\"\",\"\",ROUND(SUM(INDIRECT(CONCATENATE($A$13,\"!\",\"N\",$B15))),0))","v":""},{"$f":"IF(F15=\"\",\"\",ROUND(SUM(INDIRECT(CONCATENATE($A$13,\"!\",\"P\",$B15))),0))","v":""},{"$f":"IF(F15=\"\",\"\",ROUND(SUM(INDIRECT(CONCATENATE($A$13,\"!\",\"Q\",$B15))),0))","v":""},{"$f":"IF(G15=\"\",\"\",ROUND(SUM(INDIRECT(CONCATENATE($A$13,\"!\",\"r\",$B15))),0))","v":""},{"$f":"IF(F15=\"\",\"\",ROUND(SUM(INDIRECT(CONCATENATE($A$13,\"!\",\"s\",$B15,\":\",\"Ah\",$B15))),0))","v":""},{"$f":"IF(H15=\"\",\"\",ROUND(SUM(INDIRECT(CONCATENATE($A$13,\"!\",\"ai\",$B15))),0))","v":""},{"$f":"IF(I15=\"\",\"\",ROUND(SUM(INDIRECT(CONCATENATE($A$13,\"!\",\"aj\",$B15))),0))","v":""},{"$f":"IF(H15=\"\",\"\",ROUND(SUM(INDIRECT(CONCATENATE($A$13,\"!\",\"Ao\",$B15))),0))","v":""}]
[null,{"$f":"IF(A17=\"\",\"\",+A17)","v":""},null,null,{"$f":"IF(A16=\"\",\"\",INDIRECT(CONCATENATE($A$13,\"!\",\"B\",A16)))","v":""},"",{"$f":"IF(A16=\"\",\"\",INDIRECT(CONCATENATE($A$13,\"!\",\"B\",B16)))","v":""},{"$f":"IF(E16=\"\",\"\",ROUND(SUM(INDIRECT(CONCATENATE($A$13,\"!\",\"D\",$B16))),0))","v":""},{"$f":"IF(F16=\"\",\"\",ROUND(SUM(INDIRECT(CONCATENATE($A$13,\"!\",\"E\",$B16))),0))","v":""},{"$f":"IF(F16=\"\",\"\",ROUND(SUM(INDIRECT(CONCATENATE($A$13,\"!\",\"F\",$B16))),0))","v":""},{"$f":"IF(E16=\"\",\"\",ROUND(SUM(INDIRECT(CONCATENATE($A$13,\"!\",\"G\",$B16,\":\",\"I\",$B16))),0))","v":""},{"$f":"IF(E16=\"\",\"\",ROUND(SUM(INDIRECT(CONCATENATE($A$13,\"!\",\"J\",$B16,\":\",\"L\",$B16))),0))","v":""},{"$f":"IF(G16=\"\",\"\",ROUND(AVERAGE(INDIRECT(CONCATENATE($A$13,\"!\",\"M\",$B16))),2))","v":""},{"$f":"IF(H16=\"\",\"\",ROUND(SUM(INDIRECT(CONCATENATE($A$13,\"!\",\"N\",$B16))),0))","v":""},{"$f":"IF(F16=\"\",\"\",ROUND(SUM(INDIRECT(CONCATENATE($A$13,\"!\",\"P\",$B16))),0))","v":""},{"$f":"IF(F16=\"\",\"\",ROUND(SUM(INDIRECT(CONCATENATE($A$13,\"!\",\"Q\",$B16))),0))","v":""},{"$f":"IF(G16=\"\",\"\",ROUND(SUM(INDIRECT(CONCATENATE($A$13,\"!\",\"r\",$B16))),0))","v":""},{"$f":"IF(F16=\"\",\"\",ROUND(SUM(INDIRECT(CONCATENATE($A$13,\"!\",\"s\",$B16,\":\",\"Ah\",$B16))),0))","v":""},{"$f":"IF(H16=\"\",\"\",ROUND(SUM(INDIRECT(CONCATENATE($A$13,\"!\",\"ai\",$B16))),0))","v":""},{"$f":"IF(I16=\"\",\"\",ROUND(SUM(INDIRECT(CONCATENATE($A$13,\"!\",\"aj\",$B16))),0))","v":""},{"$f":"IF(H16=\"\",\"\",ROUND(SUM(INDIRECT(CONCATENATE($A$13,\"!\",\"Ao\",$B16))),0))","v":""}]
[null,"",null,null,"","","","","","","","","","","","","","","","",""]
[null,"",null,null,"","","","","","","","","","","","","","","","",""]
[null,"",null,null,"","","","","","","","","","","","","","","","",""]
[null,"",null,null,"","","","","","","","","","","","","","","","",""]
[null,"",null,null,"","","","","","","","","","","","","","","","",""]
[null,"",null,null,"","",{"$f":"IF(A22=\"\",\"\",INDIRECT(CONCATENATE($A$13,\"!\",\"B\",B22)))","v":""},{"$f":"IF(E22=\"\",\"\",ROUND(SUM(INDIRECT(CONCATENATE($A$13,\"!\",\"D\",$B22))),0))","v":""},{"$f":"IF(F22=\"\",\"\",ROUND(SUM(INDIRECT(CONCATENATE($A$13,\"!\",\"E\",$B22))),0))","v":""},{"$f":"IF(F22=\"\",\"\",ROUND(SUM(INDIRECT(CONCATENATE($A$13,\"!\",\"F\",$B22))),0))","v":""},{"$f":"IF(E22=\"\",\"\",ROUND(SUM(INDIRECT(CONCATENATE($A$13,\"!\",\"G\",$B22,\":\",\"I\",$B22))),0))","v":""},{"$f":"IF(E22=\"\",\"\",ROUND(SUM(INDIRECT(CONCATENATE($A$13,\"!\",\"J\",$B22,\":\",\"L\",$B22))),0))","v":""},{"$f":"IF(G22=\"\",\"\",ROUND(AVERAGE(INDIRECT(CONCATENATE($A$13,\"!\",\"M\",$B22))),2))","v":""},{"$f":"IF(H22=\"\",\"\",ROUND(SUM(INDIRECT(CONCATENATE($A$13,\"!\",\"N\",$B22))),0))","v":""},{"$f":"IF(F22=\"\",\"\",ROUND(SUM(INDIRECT(CONCATENATE($A$13,\"!\",\"P\",$B22))),0))","v":""},{"$f":"IF(F22=\"\",\"\",ROUND(SUM(INDIRECT(CONCATENATE($A$13,\"!\",\"Q\",$B22))),0))","v":""},{"$f":"IF(G22=\"\",\"\",ROUND(SUM(INDIRECT(CONCATENATE($A$13,\"!\",\"r\",$B22))),0))","v":""},{"$f":"IF(F22=\"\",\"\",ROUND(SUM(INDIRECT(CONCATENATE($A$13,\"!\",\"s\",$B22,\":\",\"Ah\",$B22))),0))","v":""},{"$f":"IF(H22=\"\",\"\",ROUND(SUM(INDIRECT(CONCATENATE($A$13,\"!\",\"ai\",$B22))),0))","v":""},{"$f":"IF(I22=\"\",\"\",ROUND(SUM(INDIRECT(CONCATENATE($A$13,\"!\",\"aj\",$B22))),0))","v":""},{"$f":"IF(H22=\"\",\"\",ROUND(SUM(INDIRECT(CONCATENATE($A$13,\"!\",\"Ao\",$B22))),0))","v":""}]
[null,"",null,null,"","","","","","","","","","","","","","","","",""]
[null,"",null,null,"","","","","","","","","","","","","","","","",""]
[null,"",null,null,"","","","","","","","","","","","","","","","",""]
[null,"",null,null,"","","","","","","","","","","","","","","","",""]
[null,"",null,null,"","","","","","","","","","","","","","","","",""]
[null,null,null,null,null,null,null,"","","","","","","","","","","","","",""]
["Grading_secondary",{"$f":"IF(A30=\"\",\"\",+A30)","v":""},null,null,"Secondary Alignment"]
[null,"",null,null,{"$f":"IF(A30=\"\",\"\",INDIRECT(CONCATENATE($A$29,\"!\",\"B\",A30)))","v":""},"",{"$f":"IF(A30=\"\",\"\",INDIRECT(CONCATENATE($A$29,\"!\",\"B\",B30)))","v":""},{"$f":"IF(E30=\"\",\"\",ROUND(SUM(INDIRECT(CONCATENATE($A$29,\"!\",\"D\",$B30))),0))","v":""},{"$f":"IF(F30=\"\",\"\",ROUND(SUM(INDIRECT(CONCATENATE($A$29,\"!\",\"E\",$B30))),0))","v":""},{"$f":"IF(F30=\"\",\"\",ROUND(SUM(INDIRECT(CONCATENATE($A$29,\"!\",\"F\",$B30))),0))","v":""},{"$f":"IF(E30=\"\",\"\",ROUND(SUM(INDIRECT(CONCATENATE($A$29,\"!\",\"G\",$B30,\":\",\"I\",$B30))),0))","v":""},{"$f":"IF(E30=\"\",\"\",ROUND(SUM(INDIRECT(CONCATENATE($A$29,\"!\",\"J\",$B30,\":\",\"L\",$B30))),0))","v":""},{"$f":"IF(G30=\"\",\"\",ROUND(AVERAGE(INDIRECT(CONCATENATE($A$29,\"!\",\"m\",$B30))),2))","v":""},{"$f":"IF(H30=\"\",\"\",ROUND(SUM(INDIRECT(CONCATENATE($A$29,\"!\",\"n\",$B30))),0))","v":""},{"$f":"IF(F30=\"\",\"\",ROUND(SUM(INDIRECT(CONCATENATE($A$29,\"!\",\"P\",$B30))),0))","v":""},{"$f":"IF(F30=\"\",\"\",ROUND(SUM(INDIRECT(CONCATENATE($A$29,\"!\",\"Q\",$B30))),0))","v":""},{"$f":"IF(G30=\"\",\"\",ROUND(SUM(INDIRECT(CONCATENATE($A$29,\"!\",\"R\",$B30))),0))","v":""},{"$f":"IF(F30=\"\",\"\",ROUND(SUM(INDIRECT(CONCATENATE($A$29,\"!\",\"S\",$B30,\":\",\"ah\",$B30))),0))","v":""},{"$f":"IF(H30=\"\",\"\",ROUND(SUM(INDIRECT(CONCATENATE($A$29,\"!\",\"ai\",$B30))),0))","v":""},{"$f":"IF(I30=\"\",\"\",ROUND(SUM(INDIRECT(CONCATENATE($A$29,\"!\",\"aj\",$B30))),0))","v":""},{"$f":"IF(H30=\"\",\"\",ROUND(SUM(INDIRECT(CONCATENATE($A$29,\"!\",\"Ao\",$B30))),0))","v":""}]
[null,"",null,null,{"$f":"IF(A31=\"\",\"\",INDIRECT(CONCATENATE($A$29,\"!\",\"B\",A31)))","v":""},{"$f":"IF(E31=\"\",\"\",\"-\")","v":""},{"$f":"IF(A31=\"\",\"\",INDIRECT(CONCATENATE($A$29,\"!\",\"B\",B31)))","v":""},{"$f":"IF(E31=\"\",\"\",ROUND(SUM(INDIRECT(CONCATENATE($A$29,\"!\",\"D\",$B31))),0))","v":""},{"$f":"IF(F31=\"\",\"\",ROUND(SUM(INDIRECT(CONCATENATE($A$29,\"!\",\"E\",$B31))),0))","v":""},{"$f":"IF(F31=\"\",\"\",ROUND(SUM(INDIRECT(CONCATENATE($A$29,\"!\",\"F\",$B31))),0))","v":""},{"$f":"IF(E31=\"\",\"\",ROUND(SUM(INDIRECT(CONCATENATE($A$29,\"!\",\"G\",$B31,\":\",\"I\",$B31))),0))","v":""},{"$f":"IF(E31=\"\",\"\",ROUND(SUM(INDIRECT(CONCATENATE($A$29,\"!\",\"J\",$B31,\":\",\"L\",$B31))),0))","v":""},{"$f":"IF(G31=\"\",\"\",ROUND(AVERAGE(INDIRECT(CONCATENATE($A$29,\"!\",\"m\",$B31))),2))","v":""},{"$f":"IF(H31=\"\",\"\",ROUND(SUM(INDIRECT(CONCATENATE($A$29,\"!\",\"n\",$B31))),0))","v":""},{"$f":"IF(F31=\"\",\"\",ROUND(SUM(INDIRECT(CONCATENATE($A$29,\"!\",\"P\",$B31))),0))","v":""},{"$f":"IF(F31=\"\",\"\",ROUND(SUM(INDIRECT(CONCATENATE($A$29,\"!\",\"Q\",$B31))),0))","v":""},{"$f":"IF(G31=\"\",\"\",ROUND(SUM(INDIRECT(CONCATENATE($A$29,\"!\",\"R\",$B31))),0))","v":""},{"$f":"IF(F31=\"\",\"\",ROUND(SUM(INDIRECT(CONCATENATE($A$29,\"!\",\"S\",$B31,\":\",\"ah\",$B31))),0))","v":""},{"$f":"IF(H31=\"\",\"\",ROUND(SUM(INDIRECT(CONCATENATE($A$29,\"!\",\"ai\",$B31))),0))","v":""},{"$f":"IF(I31=\"\",\"\",ROUND(SUM(INDIRECT(CONCATENATE($A$29,\"!\",\"aj\",$B31))),0))","v":""},{"$f":"IF(H31=\"\",\"\",ROUND(SUM(INDIRECT(CONCATENATE($A$29,\"!\",\"Ao\",$B31))),0))","v":""}]
[null,"",null,null,"","","","","","","","","","","","","","","","",""]
[null,"",null,null,"","","","","","","","","","","","","","","","",""]
[null,"",null,null,"","","","","","","","","","","","","","","","",""]
[null,"",null,null,"","","","","","","","","","","","","","","","",""]
[null,"",null,null,"","","","","","","","","","","","","","","","",""]
[null,""]
[null,{"$f":"IF(A39=\"\",\"\",+A39)","v":""},null,null,"TOTALS",null,null,{"$f":"SUM(H14:H37)","v":0},0,0,0,0,null,0,0,0,0,0,0,0,0]
[null,""]
[null,{"$f":"IF(A53=\"\",\"\",+A53)","v":""},null,null,"NOTE:"]
[null,null,null,null,null,1,"Quantities based on prismoidal (surface to surface) volumes.",null,null,null,null,null,null,null,null,null,null,null,null,null,null,null,"Notes to Designers"]
[null,null,null,null,null,2,"Conserve <<XXX>> inches of topsoil in cut and fill slope areas.  "]
[null,null,null,null,null,3,"Available material includes <<INSERT PROJECT SPECIFIC INFORMATION****>>.",null,null,null,null,null,null,null,null,null,null,null,null,null,null,null,"**** Material is anything in the grading tab in columns G, H and I"]
[null,null,null,null,null,4,"Unavailable material includes <<INSERT PROJECT SPECIFIC INFORMATION****>>.",null,null,null,null,null,null,null,null,null,null,null,null,null,null,null,"**** Material is anything in the grading tab in columns J, K and L"]
[null,null,null,null,null,5,"Various additional backfill material needed onsite includes <<INSERT PROJECT SPECIFIC INFORMATION****>>.",null,null,null,null,null,null,null,null,null,null,null,null,null,null,null,"**** Material is anything in the grading tab in columns S, T, U, V, W, X, Y, Z, AA, AB, AC, AD, AE, AF, AG and AH"]
[null,null,null,null,null,6,"Unclassified borrow quantity calculated using volumes adjusted for shrink/swell.  An assumed value of 0.9 was used for calculations. The contractor is responsible for determining the shrink/swell on the borrow material."]
[null,null,null,null,null,7,"The quantities shown herein are approximations.  Payment will be made for the actual quantities of work performed."]
[null,null,null,null,null,8,"BCY = Bank cubic yard - one cubic yard of material as it lies in the natural state.\nCCY = Compacted cubic yard - one cubic yard of material after it has been compacted to specification density."]
[]
[]
[]
[]
[null,""]
[null,""]

{"sheet":"Conserved Topsoil Summary","index":12,"n_rows":54,"n_cols":10,"rows_kept":54,"cut":false,"hidden":false,"merged":[[53,11,53,20],[54,6,54,8],[54,11,54,20],[55,6,55,8],[56,6,56,9],[46,6,46,8],[47,6,47,8],[57,6,57,8],[58,6,58,8],[53,6,53,8],[52,6,52,9],[40,6,40,8],[41,6,41,8],[45,6,45,8],[7,9,11,9],[11,0,11,1],[12,0,12,1],[28,4,28,6],[37,4,37,6],[7,8,11,8],[7,7,11,7],[1,0,10,0],[1,1,10,1],[5,4,5,9],[6,4,6,6],[7,4,12,6]]}
[]
["<---Type Beginning Row Number","<---Automatic calculates except for last row",null,null,"NOTE TO DESIGNER:  Adjust the Notes below the Grading Summary to fit your project."]
[]
[]
[]
[null,null,null,null,"CONSERVED TOPSOIL SUMMARY"]
[null,null,null,null,null,null,null,null,"For info only","62406-0300"]
[null,null,null,null,"Station to Station",null,null,"Topsoil conserved in cuts","Topsoil conserved in fills","PLACING CONSERVED TOPSOIL, 4-INCH DEPTH"]
[]
[]
[]
["Rows from"]
["Grading",null,null,null,null,null,null,"BCY","BCY","ACRE"]
[null,{"$f":"IF(A15=\"\",\"\",+A15)","v":""},null,null,{"$f":"IF(B14=\"\",\"\",INDIRECT(CONCATENATE($A$13,\"!\",\"B\",A14)))","v":""},{"$f":"IF(E14=\"\",\"\",\"-\")","v":""},{"$f":"IF(A14=\"\",\"\",INDIRECT(CONCATENATE($A$13,\"!\",\"B\",B14)))","v":""},{"$f":"IF(E14=\"\",\"\",ROUND(SUM(INDIRECT(CONCATENATE($A$13,\"!\",\"j\",$A14,\":\",\"j\",$B14))),0))","v":""},{"$f":"IF(F14=\"\",\"\",ROUND(SUM(INDIRECT(CONCATENATE($A$13,\"!\",\"z\",$A14,\":\",\"z\",$B14))),0))","v":""}]
[null,{"$f":"IF(A16=\"\",\"\",+A16)","v":""},null,null,{"$f":"IF(A15=\"\",\"\",INDIRECT(CONCATENATE($A$13,\"!\",\"B\",A15)))","v":""},"",{"$f":"IF(A15=\"\",\"\",INDIRECT(CONCATENATE($A$13,\"!\",\"B\",B15)))","v":""},{"$f":"IF(E15=\"\",\"\",ROUND(SUM(INDIRECT(CONCATENATE($A$13,\"!\",\"j\",$B15,\":\",\"j\",$B15))),0))","v":""},{"$f":"IF(F15=\"\",\"\",ROUND(SUM(INDIRECT(CONCATENATE($A$13,\"!\",\"z\",$B15,\":\",\"z\",$B15))),0))","v":""}]
[null,"",null,null,{"$f":"IF(A16=\"\",\"\",INDIRECT(CONCATENATE($A$13,\"!\",\"B\",A16)))","v":""},"",{"$f":"IF(A16=\"\",\"\",INDIRECT(CONCATENATE($A$13,\"!\",\"B\",B16)))","v":""},"",""]
[null,"",null,null,"","","","",""]
[null,"",null,null,"","","","",""]
[null,"",null,null,"","","","",""]
[null,"",null,null,"","","","",""]
[null,"",null,null,"","","","",""]
[null,"",null,null,"","","","",""]
[null,"",null,null,"","","","",""]
[null,"",null,null,"","","","",""]
[null,"",null,null,"","","","",""]
[null,"",null,null,"","","","",""]
[null,null,null,null,"","",""]
[21]
["Grading_secondary",{"$f":"IF(A30=\"\",\"\",+A30)","v":""}]
[null,"",null,null,{"$f":"IF(A30=\"\",\"\",INDIRECT(CONCATENATE($A$29,\"!\",\"B\",A30)))","v":""},"",{"$f":"IF(A30=\"\",\"\",INDIRECT(CONCATENATE($A$29,\"!\",\"B\",B30)))","v":""},{"$f":"IF(E30=\"\",\"\",ROUND(SUM(INDIRECT(CONCATENATE($A$29,\"!\",\"i\",$A30,\":\",\"k\",$B30))),0))","v":""},{"$f":"IF(F30=\"\",\"\",ROUND(SUM(INDIRECT(CONCATENATE($A$29,\"!\",\"q\",$A30,\":\",\"af\",$B30))),0))","v":""},{"$f":"IF(#REF!=\"\",\"\",ROUND(SUM(INDIRECT(CONCATENATE($A$29,\"!\",\"AM\",$B30))),0))","v":{"$error":"#REF!"}}]
[null,"",null,null,{"$f":"IF(A31=\"\",\"\",INDIRECT(CONCATENATE($A$29,\"!\",\"B\",A31)))","v":""},"",{"$f":"IF(A31=\"\",\"\",INDIRECT(CONCATENATE($A$29,\"!\",\"B\",B31)))","v":""},{"$f":"IF(E31=\"\",\"\",ROUND(SUM(INDIRECT(CONCATENATE($A$29,\"!\",\"i\",$B31,\":\",\"k\",$B31))),0))","v":""},{"$f":"IF(F31=\"\",\"\",ROUND(SUM(INDIRECT(CONCATENATE($A$29,\"!\",\"q\",$B31,\":\",\"af\",$B31))),0))","v":""},{"$f":"IF(#REF!=\"\",\"\",ROUND(SUM(INDIRECT(CONCATENATE($A$29,\"!\",\"AM\",$B31))),0))","v":{"$error":"#REF!"}}]
[null,"",null,null,"","","","","",{"$f":"IF(#REF!=\"\",\"\",ROUND(SUM(INDIRECT(CONCATENATE($A$29,\"!\",\"AM\",$B32))),0))","v":{"$error":"#REF!"}}]
[null,"",null,null,"","","","","",{"$f":"IF(#REF!=\"\",\"\",ROUND(SUM(INDIRECT(CONCATENATE($A$29,\"!\",\"AM\",$B33))),0))","v":{"$error":"#REF!"}}]
[null,"",null,null,"","","","","",{"$f":"IF(#REF!=\"\",\"\",ROUND(SUM(INDIRECT(CONCATENATE($A$29,\"!\",\"AM\",$B34))),0))","v":{"$error":"#REF!"}}]
[null,"",null,null,"","","","","",{"$f":"IF(#REF!=\"\",\"\",ROUND(SUM(INDIRECT(CONCATENATE($A$29,\"!\",\"AM\",$B35))),0))","v":{"$error":"#REF!"}}]
[null,"",null,null,"","","","","",{"$f":"IF(#REF!=\"\",\"\",ROUND(SUM(INDIRECT(CONCATENATE($A$29,\"!\",\"AM\",$B36))),0))","v":{"$error":"#REF!"}}]
[null,"",null,null,"","","","","",{"$f":"IF(#REF!=\"\",\"\",ROUND(SUM(INDIRECT(CONCATENATE($A$29,\"!\",\"AM\",$B37))),0))","v":{"$error":"#REF!"}}]
[null,"",null,null,"TOTALS",null,null,{"$f":"SUM(H14:H37)","v":0},0,{"$error":"#REF!"}]
[null,""]
[null,{"$f":"IF(A53=\"\",\"\",+A53)","v":""}]
[]
[]
[]
[]
[]
[]
[]
[]
[]
[]
[]
[]
[null,""]
[null,""]

{"sheet":"Conserved EX Pave Summary","index":13,"n_rows":54,"n_cols":9,"rows_kept":54,"cut":false,"hidden":false,"merged":[[56,6,56,8],[57,6,57,8],[58,6,58,8],[52,6,52,8],[53,6,53,8],[53,10,53,19],[54,6,54,8],[54,10,54,19],[55,6,55,8],[38,4,38,8],[40,6,40,8],[41,6,41,8],[45,6,45,8],[46,6,46,8],[47,6,47,8],[11,0,11,1],[12,0,12,1],[28,4,28,6],[37,4,37,6],[7,8,11,8],[7,7,11,7],[1,0,10,0],[1,1,10,1],[5,4,5,8],[6,4,6,6],[7,4,12,6]]}
[]
["<---Type Beginning Row Number","<---Automatic calculates except for last row",null,null,"NOTE TO DESIGNER:  Adjust the Notes below the Grading Summary to fit your project."]
[]
[]
[]
[null,null,null,null,"CONSERVED EXISTING PAVEMENT SUMMARY"]
[null,null,null,null,null,null,null,null,"For info only"]
[null,null,null,null,"Station to Station",null,null,"Existing pavement conserved in cuts","Existing pavement conserved in fills"]
[]
[]
[]
["Rows from"]
["Grading",null,null,null,null,null,null,"BCY","BCY"]
[null,{"$f":"IF(A15=\"\",\"\",+A15)","v":""},null,null,{"$f":"IF(B14=\"\",\"\",INDIRECT(CONCATENATE($A$13,\"!\",\"B\",A14)))","v":""},{"$f":"IF(E14=\"\",\"\",\"-\")","v":""},{"$f":"IF(A14=\"\",\"\",INDIRECT(CONCATENATE($A$13,\"!\",\"B\",B14)))","v":""},{"$f":"IF(E14=\"\",\"\",ROUND(SUM(INDIRECT(CONCATENATE($A$13,\"!\",\"i\",$A14,\":\",\"i\",$B14))),0))","v":""},{"$f":"IF(F14=\"\",\"\",ROUND(SUM(INDIRECT(CONCATENATE($A$13,\"!\",\"y\",$A14,\":\",\"y\",$B14))),0))","v":""}]
[null,{"$f":"IF(A16=\"\",\"\",+A16)","v":""},null,null,{"$f":"IF(A15=\"\",\"\",INDIRECT(CONCATENATE($A$13,\"!\",\"B\",A15)))","v":""},"",{"$f":"IF(A15=\"\",\"\",INDIRECT(CONCATENATE($A$13,\"!\",\"B\",B15)))","v":""},{"$f":"IF(E15=\"\",\"\",ROUND(SUM(INDIRECT(CONCATENATE($A$13,\"!\",\"i\",$B15,\":\",\"i\",$B15))),0))","v":""},{"$f":"IF(F15=\"\",\"\",ROUND(SUM(INDIRECT(CONCATENATE($A$13,\"!\",\"y\",$B15,\":\",\"y\",$B15))),0))","v":""}]
[null,"",null,null,{"$f":"IF(A16=\"\",\"\",INDIRECT(CONCATENATE($A$13,\"!\",\"B\",A16)))","v":""},"",{"$f":"IF(A16=\"\",\"\",INDIRECT(CONCATENATE($A$13,\"!\",\"B\",B16)))","v":""},"",""]
[null,"",null,null,"","","","",""]
[null,"",null,null,"","","","",""]
[null,"",null,null,"","","","",""]
[null,"",null,null,"","","","",""]
[null,"",null,null,"","","","",""]
[null,"",null,null,"","","","",""]
[null,"",null,null,"","","","",""]
[null,"",null,null,"","","","",""]
[null,"",null,null,"","","","",""]
[null,"",null,null,"","","","",""]
[null,null,null,null,"","",{"$f":"IF(A27=\"\",\"\",INDIRECT(CONCATENATE($A$13,\"!\",\"B\",B27)))","v":""},"",""]
[21]
["Grading_secondary",{"$f":"IF(A30=\"\",\"\",+A30)","v":""}]
[null,"",null,null,{"$f":"IF(A30=\"\",\"\",INDIRECT(CONCATENATE($A$29,\"!\",\"B\",A30)))","v":""},"",{"$f":"IF(A30=\"\",\"\",INDIRECT(CONCATENATE($A$29,\"!\",\"B\",B30)))","v":""},{"$f":"IF(E30=\"\",\"\",ROUND(SUM(INDIRECT(CONCATENATE($A$29,\"!\",\"i\",$A30,\":\",\"k\",$B30))),0))","v":""},{"$f":"IF(F30=\"\",\"\",ROUND(SUM(INDIRECT(CONCATENATE($A$29,\"!\",\"q\",$A30,\":\",\"af\",$B30))),0))","v":""}]
[null,"",null,null,{"$f":"IF(A31=\"\",\"\",INDIRECT(CONCATENATE($A$29,\"!\",\"B\",A31)))","v":""},"",{"$f":"IF(A31=\"\",\"\",INDIRECT(CONCATENATE($A$29,\"!\",\"B\",B31)))","v":""},{"$f":"IF(E31=\"\",\"\",ROUND(SUM(INDIRECT(CONCATENATE($A$29,\"!\",\"i\",$B31,\":\",\"k\",$B31))),0))","v":""},{"$f":"IF(F31=\"\",\"\",ROUND(SUM(INDIRECT(CONCATENATE($A$29,\"!\",\"q\",$B31,\":\",\"af\",$B31))),0))","v":""}]
[null,"",null,null,"","","","",""]
[null,"",null,null,"","","","",""]
[null,"",null,null,"","","","",""]
[null,"",null,null,"","","","",""]
[null,"",null,null,"","","","",""]
[null,"",null,null,"","","","",""]
[null,"",null,null,"TOTALS",null,null,{"$f":"SUM(H14:H37)","v":0},0]
[null,"",null,null,"Note: "]
[null,{"$f":"IF(A53=\"\",\"\",+A53)","v":""}]
[]
[]
[]
[]
[]
[]
[]
[]
[]
[]
[]
[]
[null,""]
[null,""]

{"sheet":"quantities report_secondary","index":14,"n_rows":0,"n_cols":0,"rows_kept":0,"cut":false,"hidden":false,"merged":[]}

{"sheet":"manual inputs_secondary","index":15,"n_rows":39,"n_cols":13,"rows_kept":39,"cut":false,"hidden":false,"merged":[]}
[]
[null,"Shrink/Swell Factor Summary",null,null,null,"Various Backfill Material Generated Onsite",null,null,"Number of Rows",null,null,null,"Station Range"]
[null,"Begin Station","End Station","Factor",null,"Place an 'x' in the row for any backfill material that is expected to be generated from onsite excavation.",null,null,{"$f":"LOOKUP(2,1/('quantities report_secondary'!A:A<>\"\"),ROW('quantities report_secondary'!A:A))","v":{"$error":"#N/A"}},null,null,"Add Starting Station"]
[null,null,null,null,null,"If the material below is expected to be imported because there is not any material from onsite that will meet the material quality requirements, leave the row blank."]
[]
[null,null,null,null,null,"………………..Verify with Geotech and Materials……………….."]
[null,{"$f":"IFERROR(INDEX('manual inputs_secondary'!M:M,SMALL(IF(#REF!<>\"\",ROW(#REF!)),ROW(8:8))),\"\")","v":""},null,null,null,"Material Type","Typical Uses","Generated from Onsite Material?"]
[]
[]
[null,null,null,null,null,"Wall Backfill","MSE Wall, SMSE Wall, Rockery, Concrete Retaining Wall with Parapet"]
[]
[null,null,null,null,null,"Foundation Fill","MSE Wall, SMSE Wall, Rockery, Concrete Cut Wall, Concrete Retaining Wall with Parapet, Concrete Fill Wall"]
[]
[]
[null,null,null,null,null,"Select Wall Backfill","MSE Wall, SMSE Wall, GFMSE Wall"]
[]
[null,null,null,null,null,"Rock","Rockery"]
[]
[null,null,null,null,null,"Granular Rock Backdrain","Rockery"]
[]
[null,null,null,null,null,"Structural Backfill","Guardwall, Concrete Cut Wall, Concrete Retaining Wall with Parapet, Concrete Fill Wall"]
[]
[null,"Note:  Do not use '+' sign in begin and end stations above",null,null,null,"Backfill Material","Guardwall, Concrete Retaining Wall with Parapet, Soil Nail Wall"]
[]
[null,null,null,null,null,"Granular Backfill","GFMSE Wall"]
[]
[]
[null,null,null,null,null,"Subex Backfill","Volume may be calculated by\n a. GEOPAK, \n b. Input by hand, or\n c. Both GEOPAK and hand calculations"]
[]
[]
[null,null,null,null,null,"Aggregate Base","Volume not generated by GEOPAK - input by hand."]
[]
[null,null,null,null,null,"Riprap","Volume not generated by GEOPAK - input by hand."]
[]
[null,null,null,null,null,"Special Rock Embankment","Volume not generated by GEOPAK - input by hand."]
[]
[null,null,null,null,null,"Embankment for Roadway Obliteration","Volume not generated by GEOPAK - input by hand."]
[]
[null,null,null,null,null,"Topping or Select Topping","Volume not generated by GEOPAK - input by hand."]

{"sheet":"Grading_secondary","index":16,"n_rows":32,"n_cols":42,"rows_kept":32,"cut":false,"hidden":false,"merged":[[3,14,3,16],[3,2,3,4],[3,6,3,8],[3,9,3,11],[3,12,5,12],[3,13,5,13],[3,39,4,39],[3,40,4,40],[3,41,4,41],[3,18,3,33],[3,34,4,34],[3,35,4,35],[3,36,4,36],[3,37,4,37],[3,38,4,38]]}
[null,null,null,null,null,"Pay Column",null,null,null,null,null,null,null,null,null,null,null,"Pay Column"]
[]
["TOTALS",null,{"$f":"SUM(C8:C32)","v":0},{"$f":"SUM(D8:D32)","v":0},{"$f":"SUM(E8:E32)","v":0},{"$f":"SUM(F8:F32)","v":0},{"$f":"SUM(G8:G32)","v":0},0,0,0,0,0,null,{"$f":"SUM(N8:N32)","v":0},{"$f":"SUM(O8:O32)","v":0},{"$f":"SUM(P8:P32)","v":0},{"$f":"SUM(Q8:Q32)","v":0},{"$f":"SUM(R8:R32)","v":0},{"$f":"SUM(S8:S32)","v":0},0,0,0,0,0,0,0,0,0,0,0,0,0,0,0,{"$f":"SUM(AI8:AI32)","v":0},{"$f":"SUM(AJ7:AJ186)","v":0},{"$f":"SUM(AK7:AK186)","v":0},{"$f":"SUM(AL7:AL186)","v":0},{"$f":"SUM(AM7:AM186)","v":0},{"$f":"AVERAGE(AN8:AN186)","v":0.89999999999999969},{"$f":"SUM(AO7:AO186)","v":0}]
[null,null,"Excavation",null,null,"Total","Excavation Material Available for Fill",null,null,"Excavation Material Unavailable for Fills",null,null,"Shrink/Swell Factor","Total Excavation Available for Fills","Embankment",null,null,null,"Various Backfill Material Generated Onsite",null,null,null,null,null,null,null,null,null,null,null,null,null,null,null,"Total Embankment","Excavation \n-\nEmbankment","Waste","Embankment Construction","Unclassifed Borrow Required","Unclassified Borrow Shrink/Swell","Unclassified Borrow","Mass Ordinate"]
[null,null,"Roadway prism minus topsoil and pavement","Total Excavation for Pay\nVolumes_Cut+Existing_Payment (not replaced)+Topsoil","Approach Road","Total Excavation for Pay","(+)\nStructure Excavation (Walls)","(+)\nExcavation\nFrom\nRoadway\nObliteration","(+)\nSubexcavation","(-)\nPavement Removal in Cuts","(-)\nTopsoil Stripping in Cuts","(-)\nDisposal of Subexcavation Material",null,null,"Roadway Prism (Embankment) plus backfill for topsoil in fills and existing pavment in fills\n","Total Roadway Prism Fill","Approach Road","Total Roadway Prism Fill for Pay","(+)\nWall Backfill","(+)\nFoundation\nFill","(+)\nSelect Wall\nBackfill","(+)\nRock","(+)\nGranular\nRock Backdrain","(+)\nStructural Backfill","(+)\nBackfill\nMaterial","(+)\nGranular\nBackfill","\nBackfill for Pavement Removal Under Fill","\nTopsoil Replacement Under Fill","(+)\nSub-excavation","(+)\nAggregate Base","(+)\nRiprap","(+)\nSpecial Rock Embankment","(+)\nEmbankment For Roadway Obliteration","(+)\nTopping or Select Topping"]
["ORD Component Name",null,"Volumes_Cut: ","Total Excavation","--","Total Excavation for Pay","--","--","XS_TC_Subex_Exc2: ","CFL Exist Pvmt (removed): ","CFL Exist Topsoil (removed): ","XS_TC_Subex_Exc2: ",null,null,"Volumes_Fill: ",null,"--","Total Embankment for Pay","--","--","XS_TC_MSE Wall Backfill 2: ","XS_TC_Rockery Wall Backfill 2: ","XS_TC_Rockery Wall Back: ","XS_TC_Wall Backfill: ","--","Need gabion faced MSE component","CFL Exist Pvmt (removed and replaced): ","CFL Exist Topsoil (removed and replaced): ","XS_TC_Subex_Backfill1: "]
["Enter Start of Project",{"$f":"IFERROR(INDEX('manual inputs_secondary'!M:M,SMALL(IF('manual inputs_secondary'!M:M<>\"\",ROW('manual inputs_secondary'!M:M)),ROW(2:2))),\"\")","v":""}]
[null,{"$f":"IFERROR(INDEX('manual inputs_secondary'!M:M,SMALL(IF('manual inputs_secondary'!M:M<>\"\",ROW('manual inputs_secondary'!M:M)),ROW(3:3))),\"\")","v":""},{"$f":"IF(B8=\"\",\"\",IFERROR(INDEX('quantities report_secondary'!$D$2:$D$10003,SMALL(IF('quantities report_secondary'!$A$2:$A$10003=C$6,ROW('quantities report_secondary'!$A$2:$A$10003)-1,\"\"),ROWS($B$8:$B8))),\"0\"))","v":""},{"$f":"IF(B8=\"\",\"\",$C8+$J8+$K8)","v":""},null,{"$f":"IF(B8=\"\",\"\",$D8+$E8)","v":""},{"$f":"IF($B8=\"\",\"\",Structure_Ex_Secondary!I8)","v":""},null,{"$f":"IF($B8=\"\",\"\",IFERROR(INDEX('quantities report_secondary'!$D$2:$D$10003,SMALL(IF('quantities report_secondary'!$A$2:$A$10003=I$6,ROW('quantities report_secondary'!$A$2:$A$10003)-1,\"\"),ROWS($B$8:$B8))),\"0\"))","v":""},{"$f":"IF($B8=\"\",\"\",[1]Removals_secondary!$F5)","v":""},{"$f":"IF($B8=\"\",\"\",Removals_Secondary!$K5)","v":""},{"$f":"IF($B8=\"\",\"\",IFERROR(INDEX('quantities report_secondary'!$D$2:$D$10003,SMALL(IF('quantities report_secondary'!$A$2:$A$10003=L$6,ROW('quantities report_secondary'!$A$2:$A$10003)-1,\"\"),ROWS($B$8:$B8))),\"0\"))","v":""},{"$f":"IF(B8=\"\",\"\",LOOKUP(B8,'manual inputs_secondary'!$B$4:$B$22,'manual inputs_secondary'!$D$4:$D$22))","v":""},{"$f":"IF(B8 =\"\",\"\",(($F8+$G8+$H8+$I8-$J8-$K8-$L8)*$M8))","v":""},{"$f":"IF($B8=\"\",\"\",IFERROR(INDEX('quantities report_secondary'!$D$2:$D$10003,SMALL(IF('quantities report_secondary'!$A$2:$A$10003=O$6,ROW('quantities report_secondary'!$A$2:$A$10003)-1,\"\"),ROWS($B$8:$B8))),\"0\"))","v":""},{"$f":"IF(B8=\"\",\"\",$O8-$AA8-$AB8)","v":""},null,{"$f":"IF(D8=\"\",\"\",$O8-$AA8-$AB8+$Q8)","v":""},{"$f":"IF($B8=\"\",\"\",Backfill_Secondary!E8)","v":""},{"$f":"IF($B8=\"\",\"\",Backfill_Secondary!H8)","v":""},{"$f":"IF($B8=\"\",\"\",IFERROR(INDEX('quantities report_secondary'!$D$2:$D$10003,SMALL(IF('quantities report_secondary'!$A$2:$A$10003=U$6,ROW('quantities report_secondary'!$A$2:$A$10003)-1,\"\"),ROWS($B$8:$B8))),\"0\"))","v":""},{"$f":"IF($B8=\"\",\"\",IFERROR(INDEX('quantities report_secondary'!$D$2:$D$10003,SMALL(IF('quantities report_secondary'!$A$2:$A$10003=V$6,ROW('quantities report_secondary'!$A$2:$A$10003)-1,\"\"),ROWS($B$8:$B8))),\"0\"))","v":""},{"$f":"IF($B8=\"\",\"\",IFERROR(INDEX('quantities report_secondary'!$D$2:$D$10003,SMALL(IF('quantities report_secondary'!$A$2:$A$10003=W$6,ROW('quantities report_secondary'!$A$2:$A$10003)-1,\"\"),ROWS($B$8:$B8))),\"0\"))","v":""},{"$f":"IF($B8=\"\",\"\",IFERROR(INDEX('quantities report_secondary'!$D$2:$D$10003,SMALL(IF('quantities report_secondary'!$A$2:$A$10003=X$6,ROW('quantities report_secondary'!$A$2:$A$10003)-1,\"\"),ROWS($B$8:$B8))),\"0\"))","v":""},{"$f":"IF($B8=\"\",\"\",Backfill_Secondary!P8)","v":""},{"$f":"IF($B8=\"\",\"\",IFERROR(INDEX('quantities report_secondary'!$D$2:$D$10003,SMALL(IF('quantities report_secondary'!$A$2:$A$10003=Z$6,ROW('quantities report_secondary'!$A$2:$A$10003)-1,\"\"),ROWS($B$8:$B8))),\"0\"))","v":""},{"$f":"IF($B8=\"\",\"\",Removals_Secondary!$G5)","v":""},{"$f":"IF($B8=\"\",\"\",Removals_Secondary!$L5)","v":""},{"$f":"IF($B8=\"\",\"\",IFERROR(INDEX('quantities report_secondary'!$D$2:$D$10003,SMALL(IF('quantities report_secondary'!$A$2:$A$10003=AC$6,ROW('quantities report_secondary'!$A$2:$A$10003)-1,\"\"),ROWS($B$8:$B8))),\"0\"))","v":""},{"$f":"IF($B8=\"\",\"\",IFERROR(INDEX('quantities report_secondary'!$D$2:$D$10003,SMALL(IF('quantities report_secondary'!$A$2:$A$10003=AD$6,ROW('quantities report_secondary'!$A$2:$A$10003)-1,\"\"),ROWS($B$8:$B8))),\"0\"))","v":""},{"$f":"IF($B8=\"\",\"\",IFERROR(INDEX('quantities report_secondary'!$D$2:$D$10003,SMALL(IF('quantities report_secondary'!$A$2:$A$10003=AE$6,ROW('quantities report_secondary'!$A$2:$A$10003)-1,\"\"),ROWS($B$8:$B8))),\"0\"))","v":""},{"$f":"IF($B8=\"\",\"\",IFERROR(INDEX('quantities report_secondary'!$D$2:$D$10003,SMALL(IF('quantities report_secondary'!$A$2:$A$10003=AF$6,ROW('quantities report_secondary'!$A$2:$A$10003)-1,\"\"),ROWS($B$8:$B8))),\"0\"))","v":""},{"$f":"IF($B8=\"\",\"\",IFERROR(INDEX('quantities report_secondary'!$D$2:$D$10003,SMALL(IF('quantities report_secondary'!$A$2:$A$10003=AG$6,ROW('quantities report_secondary'!$A$2:$A$10003)-1,\"\"),ROWS($B$8:$B8))),\"0\"))","v":""},{"$f":"IF($B8=\"\",\"\",IFERROR(INDEX('quantities report_secondary'!$D$2:$D$10003,SMALL(IF('quantities report_secondary'!$A$2:$A$10003=AH$6,ROW('quantities report_secondary'!$A$2:$A$10003)-1,\"\"),ROWS($B$8:$B8))),\"0\"))","v":""},{"$f":"IF(B8=\"\",\"\",$O8+$Q8+$S8+$T8+$U8+$V8+$W8+$X8+$Y8+$Z8+$AC8+$AD8+$AE8+$AF8+$AG8+$AH8)","v":""},{"$f":"IF(B8=\"\",\"\",$N8-$AI8)","v":""},{"$f":"IF(B8=\"\",\"\",$AJ8)","v":""},{"$f":"IF(B8=\"\",\"\",$O8+$Q8)","v":""},{"$f":"IF(B8=\"\",\"\",-$AJ8)","v":""},0.9,{"$f":"IF(B8=\"\",\"\",AM8/AN8)","v":""},{"$f":"AJ8","v":""}]
[null,{"$f":"IFERROR(INDEX('manual inputs_secondary'!M:M,SMALL(IF('manual inputs_secondary'!M:M<>\"\",ROW('manual inputs_secondary'!M:M)),ROW(4:4))),\"\")","v":""},{"$f":"IF(B9=\"\",\"\",IFERROR(INDEX('quantities report_secondary'!$D$2:$D$10003,SMALL(IF('quantities report_secondary'!$A$2:$A$10003=C$6,ROW('quantities report_secondary'!$A$2:$A$10003)-1,\"\"),ROWS($B$8:$B9))),\"0\"))","v":""},{"$f":"IF(B9=\"\",\"\",$C9+$J9+$K9)","v":""},null,{"$f":"IF(B9=\"\",\"\",$D9+$E9)","v":""},{"$f":"IF($B9=\"\",\"\",Structure_Ex_Secondary!I9)","v":""},null,{"$f":"IF($B9=\"\",\"\",IFERROR(INDEX('quantities report_secondary'!$D$2:$D$10003,SMALL(IF('quantities report_secondary'!$A$2:$A$10003=I$6,ROW('quantities report_secondary'!$A$2:$A$10003)-1,\"\"),ROWS($B$8:$B9))),\"0\"))","v":""},{"$f":"IF($B9=\"\",\"\",[1]Removals_secondary!$F6)","v":""},{"$f":"IF($B9=\"\",\"\",Removals_Secondary!$K6)","v":""},{"$f":"IF($B9=\"\",\"\",IFERROR(INDEX('quantities report_secondary'!$D$2:$D$10003,SMALL(IF('quantities report_secondary'!$A$2:$A$10003=L$6,ROW('quantities report_secondary'!$A$2:$A$10003)-1,\"\"),ROWS($B$8:$B9))),\"0\"))","v":""},{"$f":"IF(B9=\"\",\"\",LOOKUP(B9,'manual inputs_secondary'!$B$4:$B$22,'manual inputs_secondary'!$D$4:$D$22))","v":""},{"$f":"IF(B9 =\"\",\"\",(($F9+$G9+$H9+$I9-$J9-$K9-$L9)*$M9))","v":""},{"$f":"IF($B9=\"\",\"\",IFERROR(INDEX('quantities report_secondary'!$D$2:$D$10003,SMALL(IF('quantities report_secondary'!$A$2:$A$10003=O$6,ROW('quantities report_secondary'!$A$2:$A$10003)-1,\"\"),ROWS($B$8:$B9))),\"0\"))","v":""},{"$f":"IF(B9=\"\",\"\",$O9-$AA9-$AB9)","v":""},null,{"$f":"IF(D9=\"\",\"\",$O9-$AA9-$AB9+$Q9)","v":""},{"$f":"IF($B9=\"\",\"\",Backfill_Secondary!E9)","v":""},{"$f":"IF($B9=\"\",\"\",Backfill_Secondary!H9)","v":""},{"$f":"IF($B9=\"\",\"\",IFERROR(INDEX('quantities report_secondary'!$D$2:$D$10003,SMALL(IF('quantities report_secondary'!$A$2:$A$10003=U$6,ROW('quantities report_secondary'!$A$2:$A$10003)-1,\"\"),ROWS($B$8:$B9))),\"0\"))","v":""},{"$f":"IF($B9=\"\",\"\",IFERROR(INDEX('quantities report_secondary'!$D$2:$D$10003,SMALL(IF('quantities report_secondary'!$A$2:$A$10003=V$6,ROW('quantities report_secondary'!$A$2:$A$10003)-1,\"\"),ROWS($B$8:$B9))),\"0\"))","v":""},{"$f":"IF($B9=\"\",\"\",IFERROR(INDEX('quantities report_secondary'!$D$2:$D$10003,SMALL(IF('quantities report_secondary'!$A$2:$A$10003=W$6,ROW('quantities report_secondary'!$A$2:$A$10003)-1,\"\"),ROWS($B$8:$B9))),\"0\"))","v":""},{"$f":"IF($B9=\"\",\"\",IFERROR(INDEX('quantities report_secondary'!$D$2:$D$10003,SMALL(IF('quantities report_secondary'!$A$2:$A$10003=X$6,ROW('quantities report_secondary'!$A$2:$A$10003)-1,\"\"),ROWS($B$8:$B9))),\"0\"))","v":""},{"$f":"IF($B9=\"\",\"\",Backfill_Secondary!P9)","v":""},{"$f":"IF($B9=\"\",\"\",IFERROR(INDEX('quantities report_secondary'!$D$2:$D$10003,SMALL(IF('quantities report_secondary'!$A$2:$A$10003=Z$6,ROW('quantities report_secondary'!$A$2:$A$10003)-1,\"\"),ROWS($B$8:$B9))),\"0\"))","v":""},{"$f":"IF($B9=\"\",\"\",Removals_Secondary!$G6)","v":""},{"$f":"IF($B9=\"\",\"\",Removals_Secondary!$L6)","v":""},{"$f":"IF($B9=\"\",\"\",IFERROR(INDEX('quantities report_secondary'!$D$2:$D$10003,SMALL(IF('quantities report_secondary'!$A$2:$A$10003=AC$6,ROW('quantities report_secondary'!$A$2:$A$10003)-1,\"\"),ROWS($B$8:$B9))),\"0\"))","v":""},{"$f":"IF($B9=\"\",\"\",IFERROR(INDEX('quantities report_secondary'!$D$2:$D$10003,SMALL(IF('quantities report_secondary'!$A$2:$A$10003=AD$6,ROW('quantities report_secondary'!$A$2:$A$10003)-1,\"\"),ROWS($B$8:$B9))),\"0\"))","v":""},{"$f":"IF($B9=\"\",\"\",IFERROR(INDEX('quantities report_secondary'!$D$2:$D$10003,SMALL(IF('quantities report_secondary'!$A$2:$A$10003=AE$6,ROW('quantities report_secondary'!$A$2:$A$10003)-1,\"\"),ROWS($B$8:$B9))),\"0\"))","v":""},{"$f":"IF($B9=\"\",\"\",IFERROR(INDEX('quantities report_secondary'!$D$2:$D$10003,SMALL(IF('quantities report_secondary'!$A$2:$A$10003=AF$6,ROW('quantities report_secondary'!$A$2:$A$10003)-1,\"\"),ROWS($B$8:$B9))),\"0\"))","v":""},{"$f":"IF($B9=\"\",\"\",IFERROR(INDEX('quantities report_secondary'!$D$2:$D$10003,SMALL(IF('quantities report_secondary'!$A$2:$A$10003=AG$6,ROW('quantities report_secondary'!$A$2:$A$10003)-1,\"\"),ROWS($B$8:$B9))),\"0\"))","v":""},{"$f":"IF($B9=\"\",\"\",IFERROR(INDEX('quantities report_secondary'!$D$2:$D$10003,SMALL(IF('quantities report_secondary'!$A$2:$A$10003=AH$6,ROW('quantities report_secondary'!$A$2:$A$10003)-1,\"\"),ROWS($B$8:$B9))),\"0\"))","v":""},{"$f":"IF(B9=\"\",\"\",$O9+$Q9+$S9+$T9+$U9+$V9+$W9+$X9+$Y9+$Z9+$AC9+$AD9+$AE9+$AF9+$AG9+$AH9)","v":""},{"$f":"IF(B9=\"\",\"\",$N9-$AI9)","v":""},{"$f":"IF(B9=\"\",\"\",$AJ9)","v":""},{"$f":"IF(B9=\"\",\"\",$O9+$Q9)","v":""},{"$f":"IF(B9=\"\",\"\",-$AJ9)","v":""},0.9,{"$f":"IF(B9=\"\",\"\",AM9/AN9)","v":""},{"$f":"AJ9","v":""}]
[null,{"$f":"IFERROR(INDEX('manual inputs_secondary'!M:M,SMALL(IF('manual inputs_secondary'!M:M<>\"\",ROW('manual inputs_secondary'!M:M)),ROW(5:5))),\"\")","v":""},{"$f":"IF(B10=\"\",\"\",IFERROR(INDEX('quantities report_secondary'!$D$2:$D$10003,SMALL(IF('quantities report_secondary'!$A$2:$A$10003=C$6,ROW('quantities report_secondary'!$A$2:$A$10003)-1,\"\"),ROWS($B$8:$B10))),\"0\"))","v":""},"",null,"",{"$f":"IF($B10=\"\",\"\",Structure_Ex_Secondary!I10)","v":""},null,{"$f":"IF($B10=\"\",\"\",IFERROR(INDEX('quantities report_secondary'!$D$2:$D$10003,SMALL(IF('quantities report_secondary'!$A$2:$A$10003=I$6,ROW('quantities report_secondary'!$A$2:$A$10003)-1,\"\"),ROWS($B$8:$B10))),\"0\"))","v":""},{"$f":"IF($B10=\"\",\"\",[1]Removals_secondary!$F7)","v":""},{"$f":"IF($B10=\"\",\"\",Removals_Secondary!$K7)","v":""},{"$f":"IF($B10=\"\",\"\",IFERROR(INDEX('quantities report_secondary'!$D$2:$D$10003,SMALL(IF('quantities report_secondary'!$A$2:$A$10003=L$6,ROW('quantities report_secondary'!$A$2:$A$10003)-1,\"\"),ROWS($B$8:$B10))),\"0\"))","v":""},{"$f":"IF(B10=\"\",\"\",LOOKUP(B10,'manual inputs_secondary'!$B$4:$B$22,'manual inputs_secondary'!$D$4:$D$22))","v":""},"",{"$f":"IF($B10=\"\",\"\",IFERROR(INDEX('quantities report_secondary'!$D$2:$D$10003,SMALL(IF('quantities report_secondary'!$A$2:$A$10003=O$6,ROW('quantities report_secondary'!$A$2:$A$10003)-1,\"\"),ROWS($B$8:$B10))),\"0\"))","v":""},"",null,"",{"$f":"IF($B10=\"\",\"\",Backfill_Secondary!E10)","v":""},{"$f":"IF($B10=\"\",\"\",Backfill_Secondary!H10)","v":""},{"$f":"IF($B10=\"\",\"\",IFERROR(INDEX('quantities report_secondary'!$D$2:$D$10003,SMALL(IF('quantities report_secondary'!$A$2:$A$10003=U$6,ROW('quantities report_secondary'!$A$2:$A$10003)-1,\"\"),ROWS($B$8:$B10))),\"0\"))","v":""},{"$f":"IF($B10=\"\",\"\",IFERROR(INDEX('quantities report_secondary'!$D$2:$D$10003,SMALL(IF('quantities report_secondary'!$A$2:$A$10003=V$6,ROW('quantities report_secondary'!$A$2:$A$10003)-1,\"\"),ROWS($B$8:$B10))),\"0\"))","v":""},{"$f":"IF($B10=\"\",\"\",IFERROR(INDEX('quantities report_secondary'!$D$2:$D$10003,SMALL(IF('quantities report_secondary'!$A$2:$A$10003=W$6,ROW('quantities report_secondary'!$A$2:$A$10003)-1,\"\"),ROWS($B$8:$B10))),\"0\"))","v":""},{"$f":"IF($B10=\"\",\"\",IFERROR(INDEX('quantities report_secondary'!$D$2:$D$10003,SMALL(IF('quantities report_secondary'!$A$2:$A$10003=X$6,ROW('quantities report_secondary'!$A$2:$A$10003)-1,\"\"),ROWS($B$8:$B10))),\"0\"))","v":""},{"$f":"IF($B10=\"\",\"\",Backfill_Secondary!P10)","v":""},{"$f":"IF($B10=\"\",\"\",IFERROR(INDEX('quantities report_secondary'!$D$2:$D$10003,SMALL(IF('quantities report_secondary'!$A$2:$A$10003=Z$6,ROW('quantities report_secondary'!$A$2:$A$10003)-1,\"\"),ROWS($B$8:$B10))),\"0\"))","v":""},{"$f":"IF($B10=\"\",\"\",Removals_Secondary!$G7)","v":""},{"$f":"IF($B10=\"\",\"\",Removals_Secondary!$L7)","v":""},{"$f":"IF($B10=\"\",\"\",IFERROR(INDEX('quantities report_secondary'!$D$2:$D$10003,SMALL(IF('quantities report_secondary'!$A$2:$A$10003=AC$6,ROW('quantities report_secondary'!$A$2:$A$10003)-1,\"\"),ROWS($B$8:$B10))),\"0\"))","v":""},{"$f":"IF($B10=\"\",\"\",IFERROR(INDEX('quantities report_secondary'!$D$2:$D$10003,SMALL(IF('quantities report_secondary'!$A$2:$A$10003=AD$6,ROW('quantities report_secondary'!$A$2:$A$10003)-1,\"\"),ROWS($B$8:$B10))),\"0\"))","v":""},{"$f":"IF($B10=\"\",\"\",IFERROR(INDEX('quantities report_secondary'!$D$2:$D$10003,SMALL(IF('quantities report_secondary'!$A$2:$A$10003=AE$6,ROW('quantities report_secondary'!$A$2:$A$10003)-1,\"\"),ROWS($B$8:$B10))),\"0\"))","v":""},{"$f":"IF($B10=\"\",\"\",IFERROR(INDEX('quantities report_secondary'!$D$2:$D$10003,SMALL(IF('quantities report_secondary'!$A$2:$A$10003=AF$6,ROW('quantities report_secondary'!$A$2:$A$10003)-1,\"\"),ROWS($B$8:$B10))),\"0\"))","v":""},{"$f":"IF($B10=\"\",\"\",IFERROR(INDEX('quantities report_secondary'!$D$2:$D$10003,SMALL(IF('quantities report_secondary'!$A$2:$A$10003=AG$6,ROW('quantities report_secondary'!$A$2:$A$10003)-1,\"\"),ROWS($B$8:$B10))),\"0\"))","v":""},{"$f":"IF($B10=\"\",\"\",IFERROR(INDEX('quantities report_secondary'!$D$2:$D$10003,SMALL(IF('quantities report_secondary'!$A$2:$A$10003=AH$6,ROW('quantities report_secondary'!$A$2:$A$10003)-1,\"\"),ROWS($B$8:$B10))),\"0\"))","v":""},"","","","","",0.9,"",""]
[null,{"$f":"IFERROR(INDEX('manual inputs_secondary'!M:M,SMALL(IF('manual inputs_secondary'!M:M<>\"\",ROW('manual inputs_secondary'!M:M)),ROW(6:6))),\"\")","v":""},{"$f":"IF(B11=\"\",\"\",IFERROR(INDEX('quantities report_secondary'!$D$2:$D$10003,SMALL(IF('quantities report_secondary'!$A$2:$A$10003=C$6,ROW('quantities report_secondary'!$A$2:$A$10003)-1,\"\"),ROWS($B$8:$B11))),\"0\"))","v":""},"",null,"",{"$f":"IF($B11=\"\",\"\",Structure_Ex_Secondary!I11)","v":""},null,{"$f":"IF($B11=\"\",\"\",IFERROR(INDEX('quantities report_secondary'!$D$2:$D$10003,SMALL(IF('quantities report_secondary'!$A$2:$A$10003=I$6,ROW('quantities report_secondary'!$A$2:$A$10003)-1,\"\"),ROWS($B$8:$B11))),\"0\"))","v":""},{"$f":"IF($B11=\"\",\"\",[1]Removals_secondary!$F8)","v":""},{"$f":"IF($B11=\"\",\"\",Removals_Secondary!$K8)","v":""},{"$f":"IF($B11=\"\",\"\",IFERROR(INDEX('quantities report_secondary'!$D$2:$D$10003,SMALL(IF('quantities report_secondary'!$A$2:$A$10003=L$6,ROW('quantities report_secondary'!$A$2:$A$10003)-1,\"\"),ROWS($B$8:$B11))),\"0\"))","v":""},{"$f":"IF(B11=\"\",\"\",LOOKUP(B11,'manual inputs_secondary'!$B$4:$B$22,'manual inputs_secondary'!$D$4:$D$22))","v":""},"",{"$f":"IF($B11=\"\",\"\",IFERROR(INDEX('quantities report_secondary'!$D$2:$D$10003,SMALL(IF('quantities report_secondary'!$A$2:$A$10003=O$6,ROW('quantities report_secondary'!$A$2:$A$10003)-1,\"\"),ROWS($B$8:$B11))),\"0\"))","v":""},"",null,"",{"$f":"IF($B11=\"\",\"\",Backfill_Secondary!E11)","v":""},{"$f":"IF($B11=\"\",\"\",Backfill_Secondary!H11)","v":""},{"$f":"IF($B11=\"\",\"\",IFERROR(INDEX('quantities report_secondary'!$D$2:$D$10003,SMALL(IF('quantities report_secondary'!$A$2:$A$10003=U$6,ROW('quantities report_secondary'!$A$2:$A$10003)-1,\"\"),ROWS($B$8:$B11))),\"0\"))","v":""},{"$f":"IF($B11=\"\",\"\",IFERROR(INDEX('quantities report_secondary'!$D$2:$D$10003,SMALL(IF('quantities report_secondary'!$A$2:$A$10003=V$6,ROW('quantities report_secondary'!$A$2:$A$10003)-1,\"\"),ROWS($B$8:$B11))),\"0\"))","v":""},{"$f":"IF($B11=\"\",\"\",IFERROR(INDEX('quantities report_secondary'!$D$2:$D$10003,SMALL(IF('quantities report_secondary'!$A$2:$A$10003=W$6,ROW('quantities report_secondary'!$A$2:$A$10003)-1,\"\"),ROWS($B$8:$B11))),\"0\"))","v":""},{"$f":"IF($B11=\"\",\"\",IFERROR(INDEX('quantities report_secondary'!$D$2:$D$10003,SMALL(IF('quantities report_secondary'!$A$2:$A$10003=X$6,ROW('quantities report_secondary'!$A$2:$A$10003)-1,\"\"),ROWS($B$8:$B11))),\"0\"))","v":""},{"$f":"IF($B11=\"\",\"\",Backfill_Secondary!P11)","v":""},{"$f":"IF($B11=\"\",\"\",IFERROR(INDEX('quantities report_secondary'!$D$2:$D$10003,SMALL(IF('quantities report_secondary'!$A$2:$A$10003=Z$6,ROW('quantities report_secondary'!$A$2:$A$10003)-1,\"\"),ROWS($B$8:$B11))),\"0\"))","v":""},{"$f":"IF($B11=\"\",\"\",Removals_Secondary!$G8)","v":""},{"$f":"IF($B11=\"\",\"\",Removals_Secondary!$L8)","v":""},{"$f":"IF($B11=\"\",\"\",IFERROR(INDEX('quantities report_secondary'!$D$2:$D$10003,SMALL(IF('quantities report_secondary'!$A$2:$A$10003=AC$6,ROW('quantities report_secondary'!$A$2:$A$10003)-1,\"\"),ROWS($B$8:$B11))),\"0\"))","v":""},{"$f":"IF($B11=\"\",\"\",IFERROR(INDEX('quantities report_secondary'!$D$2:$D$10003,SMALL(IF('quantities report_secondary'!$A$2:$A$10003=AD$6,ROW('quantities report_secondary'!$A$2:$A$10003)-1,\"\"),ROWS($B$8:$B11))),\"0\"))","v":""},{"$f":"IF($B11=\"\",\"\",IFERROR(INDEX('quantities report_secondary'!$D$2:$D$10003,SMALL(IF('quantities report_secondary'!$A$2:$A$10003=AE$6,ROW('quantities report_secondary'!$A$2:$A$10003)-1,\"\"),ROWS($B$8:$B11))),\"0\"))","v":""},{"$f":"IF($B11=\"\",\"\",IFERROR(INDEX('quantities report_secondary'!$D$2:$D$10003,SMALL(IF('quantities report_secondary'!$A$2:$A$10003=AF$6,ROW('quantities report_secondary'!$A$2:$A$10003)-1,\"\"),ROWS($B$8:$B11))),\"0\"))","v":""},{"$f":"IF($B11=\"\",\"\",IFERROR(INDEX('quantities report_secondary'!$D$2:$D$10003,SMALL(IF('quantities report_secondary'!$A$2:$A$10003=AG$6,ROW('quantities report_secondary'!$A$2:$A$10003)-1,\"\"),ROWS($B$8:$B11))),\"0\"))","v":""},{"$f":"IF($B11=\"\",\"\",IFERROR(INDEX('quantities report_secondary'!$D$2:$D$10003,SMALL(IF('quantities report_secondary'!$A$2:$A$10003=AH$6,ROW('quantities report_secondary'!$A$2:$A$10003)-1,\"\"),ROWS($B$8:$B11))),\"0\"))","v":""},"","","","","",0.9,"",""]
[null,{"$f":"IFERROR(INDEX('manual inputs_secondary'!M:M,SMALL(IF('manual inputs_secondary'!M:M<>\"\",ROW('manual inputs_secondary'!M:M)),ROW(7:7))),\"\")","v":""},{"$f":"IF(B12=\"\",\"\",IFERROR(INDEX('quantities report_secondary'!$D$2:$D$10003,SMALL(IF('quantities report_secondary'!$A$2:$A$10003=C$6,ROW('quantities report_secondary'!$A$2:$A$10003)-1,\"\"),ROWS($B$8:$B12))),\"0\"))","v":""},"",null,"",{"$f":"IF($B12=\"\",\"\",Structure_Ex_Secondary!I12)","v":""},null,{"$f":"IF($B12=\"\",\"\",IFERROR(INDEX('quantities report_secondary'!$D$2:$D$10003,SMALL(IF('quantities report_secondary'!$A$2:$A$10003=I$6,ROW('quantities report_secondary'!$A$2:$A$10003)-1,\"\"),ROWS($B$8:$B12))),\"0\"))","v":""},{"$f":"IF($B12=\"\",\"\",[1]Removals_secondary!$F9)","v":""},{"$f":"IF($B12=\"\",\"\",Removals_Secondary!$K9)","v":""},{"$f":"IF($B12=\"\",\"\",IFERROR(INDEX('quantities report_secondary'!$D$2:$D$10003,SMALL(IF('quantities report_secondary'!$A$2:$A$10003=L$6,ROW('quantities report_secondary'!$A$2:$A$10003)-1,\"\"),ROWS($B$8:$B12))),\"0\"))","v":""},{"$f":"IF(B12=\"\",\"\",LOOKUP(B12,'manual inputs_secondary'!$B$4:$B$22,'manual inputs_secondary'!$D$4:$D$22))","v":""},"",{"$f":"IF($B12=\"\",\"\",IFERROR(INDEX('quantities report_secondary'!$D$2:$D$10003,SMALL(IF('quantities report_secondary'!$A$2:$A$10003=O$6,ROW('quantities report_secondary'!$A$2:$A$10003)-1,\"\"),ROWS($B$8:$B12))),\"0\"))","v":""},"",null,"",{"$f":"IF($B12=\"\",\"\",Backfill_Secondary!E12)","v":""},{"$f":"IF($B12=\"\",\"\",Backfill_Secondary!H12)","v":""},{"$f":"IF($B12=\"\",\"\",IFERROR(INDEX('quantities report_secondary'!$D$2:$D$10003,SMALL(IF('quantities report_secondary'!$A$2:$A$10003=U$6,ROW('quantities report_secondary'!$A$2:$A$10003)-1,\"\"),ROWS($B$8:$B12))),\"0\"))","v":""},{"$f":"IF($B12=\"\",\"\",IFERROR(INDEX('quantities report_secondary'!$D$2:$D$10003,SMALL(IF('quantities report_secondary'!$A$2:$A$10003=V$6,ROW('quantities report_secondary'!$A$2:$A$10003)-1,\"\"),ROWS($B$8:$B12))),\"0\"))","v":""},{"$f":"IF($B12=\"\",\"\",IFERROR(INDEX('quantities report_secondary'!$D$2:$D$10003,SMALL(IF('quantities report_secondary'!$A$2:$A$10003=W$6,ROW('quantities report_secondary'!$A$2:$A$10003)-1,\"\"),ROWS($B$8:$B12))),\"0\"))","v":""},{"$f":"IF($B12=\"\",\"\",IFERROR(INDEX('quantities report_secondary'!$D$2:$D$10003,SMALL(IF('quantities report_secondary'!$A$2:$A$10003=X$6,ROW('quantities report_secondary'!$A$2:$A$10003)-1,\"\"),ROWS($B$8:$B12))),\"0\"))","v":""},{"$f":"IF($B12=\"\",\"\",Backfill_Secondary!P12)","v":""},{"$f":"IF($B12=\"\",\"\",IFERROR(INDEX('quantities report_secondary'!$D$2:$D$10003,SMALL(IF('quantities report_secondary'!$A$2:$A$10003=Z$6,ROW('quantities report_secondary'!$A$2:$A$10003)-1,\"\"),ROWS($B$8:$B12))),\"0\"))","v":""},{"$f":"IF($B12=\"\",\"\",Removals_Secondary!$G9)","v":""},{"$f":"IF($B12=\"\",\"\",Removals_Secondary!$L9)","v":""},{"$f":"IF($B12=\"\",\"\",IFERROR(INDEX('quantities report_secondary'!$D$2:$D$10003,SMALL(IF('quantities report_secondary'!$A$2:$A$10003=AC$6,ROW('quantities report_secondary'!$A$2:$A$10003)-1,\"\"),ROWS($B$8:$B12))),\"0\"))","v":""},{"$f":"IF($B12=\"\",\"\",IFERROR(INDEX('quantities report_secondary'!$D$2:$D$10003,SMALL(IF('quantities report_secondary'!$A$2:$A$10003=AD$6,ROW('quantities report_secondary'!$A$2:$A$10003)-1,\"\"),ROWS($B$8:$B12))),\"0\"))","v":""},{"$f":"IF($B12=\"\",\"\",IFERROR(INDEX('quantities report_secondary'!$D$2:$D$10003,SMALL(IF('quantities report_secondary'!$A$2:$A$10003=AE$6,ROW('quantities report_secondary'!$A$2:$A$10003)-1,\"\"),ROWS($B$8:$B12))),\"0\"))","v":""},{"$f":"IF($B12=\"\",\"\",IFERROR(INDEX('quantities report_secondary'!$D$2:$D$10003,SMALL(IF('quantities report_secondary'!$A$2:$A$10003=AF$6,ROW('quantities report_secondary'!$A$2:$A$10003)-1,\"\"),ROWS($B$8:$B12))),\"0\"))","v":""},{"$f":"IF($B12=\"\",\"\",IFERROR(INDEX('quantities report_secondary'!$D$2:$D$10003,SMALL(IF('quantities report_secondary'!$A$2:$A$10003=AG$6,ROW('quantities report_secondary'!$A$2:$A$10003)-1,\"\"),ROWS($B$8:$B12))),\"0\"))","v":""},{"$f":"IF($B12=\"\",\"\",IFERROR(INDEX('quantities report_secondary'!$D$2:$D$10003,SMALL(IF('quantities report_secondary'!$A$2:$A$10003=AH$6,ROW('quantities report_secondary'!$A$2:$A$10003)-1,\"\"),ROWS($B$8:$B12))),\"0\"))","v":""},"","","","","",0.9,"",""]
[null,{"$f":"IFERROR(INDEX('manual inputs_secondary'!M:M,SMALL(IF('manual inputs_secondary'!M:M<>\"\",ROW('manual inputs_secondary'!M:M)),ROW(8:8))),\"\")","v":""},{"$f":"IF(B13=\"\",\"\",IFERROR(INDEX('quantities report_secondary'!$D$2:$D$10003,SMALL(IF('quantities report_secondary'!$A$2:$A$10003=C$6,ROW('quantities report_secondary'!$A$2:$A$10003)-1,\"\"),ROWS($B$8:$B13))),\"0\"))","v":""},"",null,"",{"$f":"IF($B13=\"\",\"\",Structure_Ex_Secondary!I13)","v":""},null,{"$f":"IF($B13=\"\",\"\",IFERROR(INDEX('quantities report_secondary'!$D$2:$D$10003,SMALL(IF('quantities report_secondary'!$A$2:$A$10003=I$6,ROW('quantities report_secondary'!$A$2:$A$10003)-1,\"\"),ROWS($B$8:$B13))),\"0\"))","v":""},{"$f":"IF($B13=\"\",\"\",[1]Removals_secondary!$F10)","v":""},{"$f":"IF($B13=\"\",\"\",Removals_Secondary!$K10)","v":""},{"$f":"IF($B13=\"\",\"\",IFERROR(INDEX('quantities report_secondary'!$D$2:$D$10003,SMALL(IF('quantities report_secondary'!$A$2:$A$10003=L$6,ROW('quantities report_secondary'!$A$2:$A$10003)-1,\"\"),ROWS($B$8:$B13))),\"0\"))","v":""},{"$f":"IF(B13=\"\",\"\",LOOKUP(B13,'manual inputs_secondary'!$B$4:$B$22,'manual inputs_secondary'!$D$4:$D$22))","v":""},"",{"$f":"IF($B13=\"\",\"\",IFERROR(INDEX('quantities report_secondary'!$D$2:$D$10003,SMALL(IF('quantities report_secondary'!$A$2:$A$10003=O$6,ROW('quantities report_secondary'!$A$2:$A$10003)-1,\"\"),ROWS($B$8:$B13))),\"0\"))","v":""},"",null,"",{"$f":"IF($B13=\"\",\"\",Backfill_Secondary!E13)","v":""},{"$f":"IF($B13=\"\",\"\",Backfill_Secondary!H13)","v":""},{"$f":"IF($B13=\"\",\"\",IFERROR(INDEX('quantities report_secondary'!$D$2:$D$10003,SMALL(IF('quantities report_secondary'!$A$2:$A$10003=U$6,ROW('quantities report_secondary'!$A$2:$A$10003)-1,\"\"),ROWS($B$8:$B13))),\"0\"))","v":""},{"$f":"IF($B13=\"\",\"\",IFERROR(INDEX('quantities report_secondary'!$D$2:$D$10003,SMALL(IF('quantities report_secondary'!$A$2:$A$10003=V$6,ROW('quantities report_secondary'!$A$2:$A$10003)-1,\"\"),ROWS($B$8:$B13))),\"0\"))","v":""},{"$f":"IF($B13=\"\",\"\",IFERROR(INDEX('quantities report_secondary'!$D$2:$D$10003,SMALL(IF('quantities report_secondary'!$A$2:$A$10003=W$6,ROW('quantities report_secondary'!$A$2:$A$10003)-1,\"\"),ROWS($B$8:$B13))),\"0\"))","v":""},{"$f":"IF($B13=\"\",\"\",IFERROR(INDEX('quantities report_secondary'!$D$2:$D$10003,SMALL(IF('quantities report_secondary'!$A$2:$A$10003=X$6,ROW('quantities report_secondary'!$A$2:$A$10003)-1,\"\"),ROWS($B$8:$B13))),\"0\"))","v":""},{"$f":"IF($B13=\"\",\"\",Backfill_Secondary!P13)","v":""},{"$f":"IF($B13=\"\",\"\",IFERROR(INDEX('quantities report_secondary'!$D$2:$D$10003,SMALL(IF('quantities report_secondary'!$A$2:$A$10003=Z$6,ROW('quantities report_secondary'!$A$2:$A$10003)-1,\"\"),ROWS($B$8:$B13))),\"0\"))","v":""},{"$f":"IF($B13=\"\",\"\",Removals_Secondary!$G10)","v":""},{"$f":"IF($B13=\"\",\"\",Removals_Secondary!$L10)","v":""},{"$f":"IF($B13=\"\",\"\",IFERROR(INDEX('quantities report_secondary'!$D$2:$D$10003,SMALL(IF('quantities report_secondary'!$A$2:$A$10003=AC$6,ROW('quantities report_secondary'!$A$2:$A$10003)-1,\"\"),ROWS($B$8:$B13))),\"0\"))","v":""},{"$f":"IF($B13=\"\",\"\",IFERROR(INDEX('quantities report_secondary'!$D$2:$D$10003,SMALL(IF('quantities report_secondary'!$A$2:$A$10003=AD$6,ROW('quantities report_secondary'!$A$2:$A$10003)-1,\"\"),ROWS($B$8:$B13))),\"0\"))","v":""},{"$f":"IF($B13=\"\",\"\",IFERROR(INDEX('quantities report_secondary'!$D$2:$D$10003,SMALL(IF('quantities report_secondary'!$A$2:$A$10003=AE$6,ROW('quantities report_secondary'!$A$2:$A$10003)-1,\"\"),ROWS($B$8:$B13))),\"0\"))","v":""},{"$f":"IF($B13=\"\",\"\",IFERROR(INDEX('quantities report_secondary'!$D$2:$D$10003,SMALL(IF('quantities report_secondary'!$A$2:$A$10003=AF$6,ROW('quantities report_secondary'!$A$2:$A$10003)-1,\"\"),ROWS($B$8:$B13))),\"0\"))","v":""},{"$f":"IF($B13=\"\",\"\",IFERROR(INDEX('quantities report_secondary'!$D$2:$D$10003,SMALL(IF('quantities report_secondary'!$A$2:$A$10003=AG$6,ROW('quantities report_secondary'!$A$2:$A$10003)-1,\"\"),ROWS($B$8:$B13))),\"0\"))","v":""},{"$f":"IF($B13=\"\",\"\",IFERROR(INDEX('quantities report_secondary'!$D$2:$D$10003,SMALL(IF('quantities report_secondary'!$A$2:$A$10003=AH$6,ROW('quantities report_secondary'!$A$2:$A$10003)-1,\"\"),ROWS($B$8:$B13))),\"0\"))","v":""},"","","","","",0.9,"",""]
[null,{"$f":"IFERROR(INDEX('manual inputs_secondary'!M:M,SMALL(IF('manual inputs_secondary'!M:M<>\"\",ROW('manual inputs_secondary'!M:M)),ROW(9:9))),\"\")","v":""},{"$f":"IF(B14=\"\",\"\",IFERROR(INDEX('quantities report_secondary'!$D$2:$D$10003,SMALL(IF('quantities report_secondary'!$A$2:$A$10003=C$6,ROW('quantities report_secondary'!$A$2:$A$10003)-1,\"\"),ROWS($B$8:$B14))),\"0\"))","v":""},"",null,"",{"$f":"IF($B14=\"\",\"\",Structure_Ex_Secondary!I14)","v":""},null,{"$f":"IF($B14=\"\",\"\",IFERROR(INDEX('quantities report_secondary'!$D$2:$D$10003,SMALL(IF('quantities report_secondary'!$A$2:$A$10003=I$6,ROW('quantities report_secondary'!$A$2:$A$10003)-1,\"\"),ROWS($B$8:$B14))),\"0\"))","v":""},{"$f":"IF($B14=\"\",\"\",[1]Removals_secondary!$F11)","v":""},{"$f":"IF($B14=\"\",\"\",Removals_Secondary!$K11)","v":""},{"$f":"IF($B14=\"\",\"\",IFERROR(INDEX('quantities report_secondary'!$D$2:$D$10003,SMALL(IF('quantities report_secondary'!$A$2:$A$10003=L$6,ROW('quantities report_secondary'!$A$2:$A$10003)-1,\"\"),ROWS($B$8:$B14))),\"0\"))","v":""},{"$f":"IF(B14=\"\",\"\",LOOKUP(B14,'manual inputs_secondary'!$B$4:$B$22,'manual inputs_secondary'!$D$4:$D$22))","v":""},"",{"$f":"IF($B14=\"\",\"\",IFERROR(INDEX('quantities report_secondary'!$D$2:$D$10003,SMALL(IF('quantities report_secondary'!$A$2:$A$10003=O$6,ROW('quantities report_secondary'!$A$2:$A$10003)-1,\"\"),ROWS($B$8:$B14))),\"0\"))","v":""},"",null,"",{"$f":"IF($B14=\"\",\"\",Backfill_Secondary!E14)","v":""},{"$f":"IF($B14=\"\",\"\",Backfill_Secondary!H14)","v":""},{"$f":"IF($B14=\"\",\"\",IFERROR(INDEX('quantities report_secondary'!$D$2:$D$10003,SMALL(IF('quantities report_secondary'!$A$2:$A$10003=U$6,ROW('quantities report_secondary'!$A$2:$A$10003)-1,\"\"),ROWS($B$8:$B14))),\"0\"))","v":""},{"$f":"IF($B14=\"\",\"\",IFERROR(INDEX('quantities report_secondary'!$D$2:$D$10003,SMALL(IF('quantities report_secondary'!$A$2:$A$10003=V$6,ROW('quantities report_secondary'!$A$2:$A$10003)-1,\"\"),ROWS($B$8:$B14))),\"0\"))","v":""},{"$f":"IF($B14=\"\",\"\",IFERROR(INDEX('quantities report_secondary'!$D$2:$D$10003,SMALL(IF('quantities report_secondary'!$A$2:$A$10003=W$6,ROW('quantities report_secondary'!$A$2:$A$10003)-1,\"\"),ROWS($B$8:$B14))),\"0\"))","v":""},{"$f":"IF($B14=\"\",\"\",IFERROR(INDEX('quantities report_secondary'!$D$2:$D$10003,SMALL(IF('quantities report_secondary'!$A$2:$A$10003=X$6,ROW('quantities report_secondary'!$A$2:$A$10003)-1,\"\"),ROWS($B$8:$B14))),\"0\"))","v":""},{"$f":"IF($B14=\"\",\"\",Backfill_Secondary!P14)","v":""},{"$f":"IF($B14=\"\",\"\",IFERROR(INDEX('quantities report_secondary'!$D$2:$D$10003,SMALL(IF('quantities report_secondary'!$A$2:$A$10003=Z$6,ROW('quantities report_secondary'!$A$2:$A$10003)-1,\"\"),ROWS($B$8:$B14))),\"0\"))","v":""},{"$f":"IF($B14=\"\",\"\",Removals_Secondary!$G11)","v":""},{"$f":"IF($B14=\"\",\"\",Removals_Secondary!$L11)","v":""},{"$f":"IF($B14=\"\",\"\",IFERROR(INDEX('quantities report_secondary'!$D$2:$D$10003,SMALL(IF('quantities report_secondary'!$A$2:$A$10003=AC$6,ROW('quantities report_secondary'!$A$2:$A$10003)-1,\"\"),ROWS($B$8:$B14))),\"0\"))","v":""},{"$f":"IF($B14=\"\",\"\",IFERROR(INDEX('quantities report_secondary'!$D$2:$D$10003,SMALL(IF('quantities report_secondary'!$A$2:$A$10003=AD$6,ROW('quantities report_secondary'!$A$2:$A$10003)-1,\"\"),ROWS($B$8:$B14))),\"0\"))","v":""},{"$f":"IF($B14=\"\",\"\",IFERROR(INDEX('quantities report_secondary'!$D$2:$D$10003,SMALL(IF('quantities report_secondary'!$A$2:$A$10003=AE$6,ROW('quantities report_secondary'!$A$2:$A$10003)-1,\"\"),ROWS($B$8:$B14))),\"0\"))","v":""},{"$f":"IF($B14=\"\",\"\",IFERROR(INDEX('quantities report_secondary'!$D$2:$D$10003,SMALL(IF('quantities report_secondary'!$A$2:$A$10003=AF$6,ROW('quantities report_secondary'!$A$2:$A$10003)-1,\"\"),ROWS($B$8:$B14))),\"0\"))","v":""},{"$f":"IF($B14=\"\",\"\",IFERROR(INDEX('quantities report_secondary'!$D$2:$D$10003,SMALL(IF('quantities report_secondary'!$A$2:$A$10003=AG$6,ROW('quantities report_secondary'!$A$2:$A$10003)-1,\"\"),ROWS($B$8:$B14))),\"0\"))","v":""},{"$f":"IF($B14=\"\",\"\",IFERROR(INDEX('quantities report_secondary'!$D$2:$D$10003,SMALL(IF('quantities report_secondary'!$A$2:$A$10003=AH$6,ROW('quantities report_secondary'!$A$2:$A$10003)-1,\"\"),ROWS($B$8:$B14))),\"0\"))","v":""},"","","","","",0.9,"",""]
[null,{"$f":"IFERROR(INDEX('manual inputs_secondary'!M:M,SMALL(IF('manual inputs_secondary'!M:M<>\"\",ROW('manual inputs_secondary'!M:M)),ROW(10:10))),\"\")","v":""},{"$f":"IF(B15=\"\",\"\",IFERROR(INDEX('quantities report_secondary'!$D$2:$D$10003,SMALL(IF('quantities report_secondary'!$A$2:$A$10003=C$6,ROW('quantities report_secondary'!$A$2:$A$10003)-1,\"\"),ROWS($B$8:$B15))),\"0\"))","v":""},"",null,"",{"$f":"IF($B15=\"\",\"\",Structure_Ex_Secondary!I15)","v":""},null,{"$f":"IF($B15=\"\",\"\",IFERROR(INDEX('quantities report_secondary'!$D$2:$D$10003,SMALL(IF('quantities report_secondary'!$A$2:$A$10003=I$6,ROW('quantities report_secondary'!$A$2:$A$10003)-1,\"\"),ROWS($B$8:$B15))),\"0\"))","v":""},{"$f":"IF($B15=\"\",\"\",[1]Removals_secondary!$F12)","v":""},{"$f":"IF($B15=\"\",\"\",Removals_Secondary!$K12)","v":""},{"$f":"IF($B15=\"\",\"\",IFERROR(INDEX('quantities report_secondary'!$D$2:$D$10003,SMALL(IF('quantities report_secondary'!$A$2:$A$10003=L$6,ROW('quantities report_secondary'!$A$2:$A$10003)-1,\"\"),ROWS($B$8:$B15))),\"0\"))","v":""},{"$f":"IF(B15=\"\",\"\",LOOKUP(B15,'manual inputs_secondary'!$B$4:$B$22,'manual inputs_secondary'!$D$4:$D$22))","v":""},"",{"$f":"IF($B15=\"\",\"\",IFERROR(INDEX('quantities report_secondary'!$D$2:$D$10003,SMALL(IF('quantities report_secondary'!$A$2:$A$10003=O$6,ROW('quantities report_secondary'!$A$2:$A$10003)-1,\"\"),ROWS($B$8:$B15))),\"0\"))","v":""},"",null,"",{"$f":"IF($B15=\"\",\"\",Backfill_Secondary!E15)","v":""},{"$f":"IF($B15=\"\",\"\",Backfill_Secondary!H15)","v":""},{"$f":"IF($B15=\"\",\"\",IFERROR(INDEX('quantities report_secondary'!$D$2:$D$10003,SMALL(IF('quantities report_secondary'!$A$2:$A$10003=U$6,ROW('quantities report_secondary'!$A$2:$A$10003)-1,\"\"),ROWS($B$8:$B15))),\"0\"))","v":""},{"$f":"IF($B15=\"\",\"\",IFERROR(INDEX('quantities report_secondary'!$D$2:$D$10003,SMALL(IF('quantities report_secondary'!$A$2:$A$10003=V$6,ROW('quantities report_secondary'!$A$2:$A$10003)-1,\"\"),ROWS($B$8:$B15))),\"0\"))","v":""},{"$f":"IF($B15=\"\",\"\",IFERROR(INDEX('quantities report_secondary'!$D$2:$D$10003,SMALL(IF('quantities report_secondary'!$A$2:$A$10003=W$6,ROW('quantities report_secondary'!$A$2:$A$10003)-1,\"\"),ROWS($B$8:$B15))),\"0\"))","v":""},{"$f":"IF($B15=\"\",\"\",IFERROR(INDEX('quantities report_secondary'!$D$2:$D$10003,SMALL(IF('quantities report_secondary'!$A$2:$A$10003=X$6,ROW('quantities report_secondary'!$A$2:$A$10003)-1,\"\"),ROWS($B$8:$B15))),\"0\"))","v":""},{"$f":"IF($B15=\"\",\"\",Backfill_Secondary!P15)","v":""},{"$f":"IF($B15=\"\",\"\",IFERROR(INDEX('quantities report_secondary'!$D$2:$D$10003,SMALL(IF('quantities report_secondary'!$A$2:$A$10003=Z$6,ROW('quantities report_secondary'!$A$2:$A$10003)-1,\"\"),ROWS($B$8:$B15))),\"0\"))","v":""},{"$f":"IF($B15=\"\",\"\",Removals_Secondary!$G12)","v":""},{"$f":"IF($B15=\"\",\"\",Removals_Secondary!$L12)","v":""},{"$f":"IF($B15=\"\",\"\",IFERROR(INDEX('quantities report_secondary'!$D$2:$D$10003,SMALL(IF('quantities report_secondary'!$A$2:$A$10003=AC$6,ROW('quantities report_secondary'!$A$2:$A$10003)-1,\"\"),ROWS($B$8:$B15))),\"0\"))","v":""},{"$f":"IF($B15=\"\",\"\",IFERROR(INDEX('quantities report_secondary'!$D$2:$D$10003,SMALL(IF('quantities report_secondary'!$A$2:$A$10003=AD$6,ROW('quantities report_secondary'!$A$2:$A$10003)-1,\"\"),ROWS($B$8:$B15))),\"0\"))","v":""},{"$f":"IF($B15=\"\",\"\",IFERROR(INDEX('quantities report_secondary'!$D$2:$D$10003,SMALL(IF('quantities report_secondary'!$A$2:$A$10003=AE$6,ROW('quantities report_secondary'!$A$2:$A$10003)-1,\"\"),ROWS($B$8:$B15))),\"0\"))","v":""},{"$f":"IF($B15=\"\",\"\",IFERROR(INDEX('quantities report_secondary'!$D$2:$D$10003,SMALL(IF('quantities report_secondary'!$A$2:$A$10003=AF$6,ROW('quantities report_secondary'!$A$2:$A$10003)-1,\"\"),ROWS($B$8:$B15))),\"0\"))","v":""},{"$f":"IF($B15=\"\",\"\",IFERROR(INDEX('quantities report_secondary'!$D$2:$D$10003,SMALL(IF('quantities report_secondary'!$A$2:$A$10003=AG$6,ROW('quantities report_secondary'!$A$2:$A$10003)-1,\"\"),ROWS($B$8:$B15))),\"0\"))","v":""},{"$f":"IF($B15=\"\",\"\",IFERROR(INDEX('quantities report_secondary'!$D$2:$D$10003,SMALL(IF('quantities report_secondary'!$A$2:$A$10003=AH$6,ROW('quantities report_secondary'!$A$2:$A$10003)-1,\"\"),ROWS($B$8:$B15))),\"0\"))","v":""},"","","","","",0.9,"",""]
[null,{"$f":"IFERROR(INDEX('manual inputs_secondary'!M:M,SMALL(IF('manual inputs_secondary'!M:M<>\"\",ROW('manual inputs_secondary'!M:M)),ROW(11:11))),\"\")","v":""},{"$f":"IF(B16=\"\",\"\",IFERROR(INDEX('quantities report_secondary'!$D$2:$D$10003,SMALL(IF('quantities report_secondary'!$A$2:$A$10003=C$6,ROW('quantities report_secondary'!$A$2:$A$10003)-1,\"\"),ROWS($B$8:$B16))),\"0\"))","v":""},"",null,"",{"$f":"IF($B16=\"\",\"\",Structure_Ex_Secondary!I16)","v":""},null,{"$f":"IF($B16=\"\",\"\",IFERROR(INDEX('quantities report_secondary'!$D$2:$D$10003,SMALL(IF('quantities report_secondary'!$A$2:$A$10003=I$6,ROW('quantities report_secondary'!$A$2:$A$10003)-1,\"\"),ROWS($B$8:$B16))),\"0\"))","v":""},{"$f":"IF($B16=\"\",\"\",[1]Removals_secondary!$F13)","v":""},{"$f":"IF($B16=\"\",\"\",Removals_Secondary!$K13)","v":""},{"$f":"IF($B16=\"\",\"\",IFERROR(INDEX('quantities report_secondary'!$D$2:$D$10003,SMALL(IF('quantities report_secondary'!$A$2:$A$10003=L$6,ROW('quantities report_secondary'!$A$2:$A$10003)-1,\"\"),ROWS($B$8:$B16))),\"0\"))","v":""},{"$f":"IF(B16=\"\",\"\",LOOKUP(B16,'manual inputs_secondary'!$B$4:$B$22,'manual inputs_secondary'!$D$4:$D$22))","v":""},"",{"$f":"IF($B16=\"\",\"\",IFERROR(INDEX('quantities report_secondary'!$D$2:$D$10003,SMALL(IF('quantities report_secondary'!$A$2:$A$10003=O$6,ROW('quantities report_secondary'!$A$2:$A$10003)-1,\"\"),ROWS($B$8:$B16))),\"0\"))","v":""},"",null,"",{"$f":"IF($B16=\"\",\"\",Backfill_Secondary!E16)","v":""},{"$f":"IF($B16=\"\",\"\",Backfill_Secondary!H16)","v":""},{"$f":"IF($B16=\"\",\"\",IFERROR(INDEX('quantities report_secondary'!$D$2:$D$10003,SMALL(IF('quantities report_secondary'!$A$2:$A$10003=U$6,ROW('quantities report_secondary'!$A$2:$A$10003)-1,\"\"),ROWS($B$8:$B16))),\"0\"))","v":""},{"$f":"IF($B16=\"\",\"\",IFERROR(INDEX('quantities report_secondary'!$D$2:$D$10003,SMALL(IF('quantities report_secondary'!$A$2:$A$10003=V$6,ROW('quantities report_secondary'!$A$2:$A$10003)-1,\"\"),ROWS($B$8:$B16))),\"0\"))","v":""},{"$f":"IF($B16=\"\",\"\",IFERROR(INDEX('quantities report_secondary'!$D$2:$D$10003,SMALL(IF('quantities report_secondary'!$A$2:$A$10003=W$6,ROW('quantities report_secondary'!$A$2:$A$10003)-1,\"\"),ROWS($B$8:$B16))),\"0\"))","v":""},{"$f":"IF($B16=\"\",\"\",IFERROR(INDEX('quantities report_secondary'!$D$2:$D$10003,SMALL(IF('quantities report_secondary'!$A$2:$A$10003=X$6,ROW('quantities report_secondary'!$A$2:$A$10003)-1,\"\"),ROWS($B$8:$B16))),\"0\"))","v":""},{"$f":"IF($B16=\"\",\"\",Backfill_Secondary!P16)","v":""},{"$f":"IF($B16=\"\",\"\",IFERROR(INDEX('quantities report_secondary'!$D$2:$D$10003,SMALL(IF('quantities report_secondary'!$A$2:$A$10003=Z$6,ROW('quantities report_secondary'!$A$2:$A$10003)-1,\"\"),ROWS($B$8:$B16))),\"0\"))","v":""},{"$f":"IF($B16=\"\",\"\",Removals_Secondary!$G13)","v":""},{"$f":"IF($B16=\"\",\"\",Removals_Secondary!$L13)","v":""},{"$f":"IF($B16=\"\",\"\",IFERROR(INDEX('quantities report_secondary'!$D$2:$D$10003,SMALL(IF('quantities report_secondary'!$A$2:$A$10003=AC$6,ROW('quantities report_secondary'!$A$2:$A$10003)-1,\"\"),ROWS($B$8:$B16))),\"0\"))","v":""},{"$f":"IF($B16=\"\",\"\",IFERROR(INDEX('quantities report_secondary'!$D$2:$D$10003,SMALL(IF('quantities report_secondary'!$A$2:$A$10003=AD$6,ROW('quantities report_secondary'!$A$2:$A$10003)-1,\"\"),ROWS($B$8:$B16))),\"0\"))","v":""},{"$f":"IF($B16=\"\",\"\",IFERROR(INDEX('quantities report_secondary'!$D$2:$D$10003,SMALL(IF('quantities report_secondary'!$A$2:$A$10003=AE$6,ROW('quantities report_secondary'!$A$2:$A$10003)-1,\"\"),ROWS($B$8:$B16))),\"0\"))","v":""},{"$f":"IF($B16=\"\",\"\",IFERROR(INDEX('quantities report_secondary'!$D$2:$D$10003,SMALL(IF('quantities report_secondary'!$A$2:$A$10003=AF$6,ROW('quantities report_secondary'!$A$2:$A$10003)-1,\"\"),ROWS($B$8:$B16))),\"0\"))","v":""},{"$f":"IF($B16=\"\",\"\",IFERROR(INDEX('quantities report_secondary'!$D$2:$D$10003,SMALL(IF('quantities report_secondary'!$A$2:$A$10003=AG$6,ROW('quantities report_secondary'!$A$2:$A$10003)-1,\"\"),ROWS($B$8:$B16))),\"0\"))","v":""},{"$f":"IF($B16=\"\",\"\",IFERROR(INDEX('quantities report_secondary'!$D$2:$D$10003,SMALL(IF('quantities report_secondary'!$A$2:$A$10003=AH$6,ROW('quantities report_secondary'!$A$2:$A$10003)-1,\"\"),ROWS($B$8:$B16))),\"0\"))","v":""},"","","","","",0.9,"",""]
[null,{"$f":"IFERROR(INDEX('manual inputs_secondary'!M:M,SMALL(IF('manual inputs_secondary'!M:M<>\"\",ROW('manual inputs_secondary'!M:M)),ROW(12:12))),\"\")","v":""},{"$f":"IF(B17=\"\",\"\",IFERROR(INDEX('quantities report_secondary'!$D$2:$D$10003,SMALL(IF('quantities report_secondary'!$A$2:$A$10003=C$6,ROW('quantities report_secondary'!$A$2:$A$10003)-1,\"\"),ROWS($B$8:$B17))),\"0\"))","v":""},"",null,"",{"$f":"IF($B17=\"\",\"\",Structure_Ex_Secondary!I17)","v":""},null,{"$f":"IF($B17=\"\",\"\",IFERROR(INDEX('quantities report_secondary'!$D$2:$D$10003,SMALL(IF('quantities report_secondary'!$A$2:$A$10003=I$6,ROW('quantities report_secondary'!$A$2:$A$10003)-1,\"\"),ROWS($B$8:$B17))),\"0\"))","v":""},{"$f":"IF($B17=\"\",\"\",[1]Removals_secondary!$F14)","v":""},{"$f":"IF($B17=\"\",\"\",Removals_Secondary!$K14)","v":""},{"$f":"IF($B17=\"\",\"\",IFERROR(INDEX('quantities report_secondary'!$D$2:$D$10003,SMALL(IF('quantities report_secondary'!$A$2:$A$10003=L$6,ROW('quantities report_secondary'!$A$2:$A$10003)-1,\"\"),ROWS($B$8:$B17))),\"0\"))","v":""},{"$f":"IF(B17=\"\",\"\",LOOKUP(B17,'manual inputs_secondary'!$B$4:$B$22,'manual inputs_secondary'!$D$4:$D$22))","v":""},"",{"$f":"IF($B17=\"\",\"\",IFERROR(INDEX('quantities report_secondary'!$D$2:$D$10003,SMALL(IF('quantities report_secondary'!$A$2:$A$10003=O$6,ROW('quantities report_secondary'!$A$2:$A$10003)-1,\"\"),ROWS($B$8:$B17))),\"0\"))","v":""},"",null,"",{"$f":"IF($B17=\"\",\"\",Backfill_Secondary!E17)","v":""},{"$f":"IF($B17=\"\",\"\",Backfill_Secondary!H17)","v":""},{"$f":"IF($B17=\"\",\"\",IFERROR(INDEX('quantities report_secondary'!$D$2:$D$10003,SMALL(IF('quantities report_secondary'!$A$2:$A$10003=U$6,ROW('quantities report_secondary'!$A$2:$A$10003)-1,\"\"),ROWS($B$8:$B17))),\"0\"))","v":""},{"$f":"IF($B17=\"\",\"\",IFERROR(INDEX('quantities report_secondary'!$D$2:$D$10003,SMALL(IF('quantities report_secondary'!$A$2:$A$10003=V$6,ROW('quantities report_secondary'!$A$2:$A$10003)-1,\"\"),ROWS($B$8:$B17))),\"0\"))","v":""},{"$f":"IF($B17=\"\",\"\",IFERROR(INDEX('quantities report_secondary'!$D$2:$D$10003,SMALL(IF('quantities report_secondary'!$A$2:$A$10003=W$6,ROW('quantities report_secondary'!$A$2:$A$10003)-1,\"\"),ROWS($B$8:$B17))),\"0\"))","v":""},{"$f":"IF($B17=\"\",\"\",IFERROR(INDEX('quantities report_secondary'!$D$2:$D$10003,SMALL(IF('quantities report_secondary'!$A$2:$A$10003=X$6,ROW('quantities report_secondary'!$A$2:$A$10003)-1,\"\"),ROWS($B$8:$B17))),\"0\"))","v":""},{"$f":"IF($B17=\"\",\"\",Backfill_Secondary!P17)","v":""},{"$f":"IF($B17=\"\",\"\",IFERROR(INDEX('quantities report_secondary'!$D$2:$D$10003,SMALL(IF('quantities report_secondary'!$A$2:$A$10003=Z$6,ROW('quantities report_secondary'!$A$2:$A$10003)-1,\"\"),ROWS($B$8:$B17))),\"0\"))","v":""},{"$f":"IF($B17=\"\",\"\",Removals_Secondary!$G14)","v":""},{"$f":"IF($B17=\"\",\"\",Removals_Secondary!$L14)","v":""},{"$f":"IF($B17=\"\",\"\",IFERROR(INDEX('quantities report_secondary'!$D$2:$D$10003,SMALL(IF('quantities report_secondary'!$A$2:$A$10003=AC$6,ROW('quantities report_secondary'!$A$2:$A$10003)-1,\"\"),ROWS($B$8:$B17))),\"0\"))","v":""},{"$f":"IF($B17=\"\",\"\",IFERROR(INDEX('quantities report_secondary'!$D$2:$D$10003,SMALL(IF('quantities report_secondary'!$A$2:$A$10003=AD$6,ROW('quantities report_secondary'!$A$2:$A$10003)-1,\"\"),ROWS($B$8:$B17))),\"0\"))","v":""},{"$f":"IF($B17=\"\",\"\",IFERROR(INDEX('quantities report_secondary'!$D$2:$D$10003,SMALL(IF('quantities report_secondary'!$A$2:$A$10003=AE$6,ROW('quantities report_secondary'!$A$2:$A$10003)-1,\"\"),ROWS($B$8:$B17))),\"0\"))","v":""},{"$f":"IF($B17=\"\",\"\",IFERROR(INDEX('quantities report_secondary'!$D$2:$D$10003,SMALL(IF('quantities report_secondary'!$A$2:$A$10003=AF$6,ROW('quantities report_secondary'!$A$2:$A$10003)-1,\"\"),ROWS($B$8:$B17))),\"0\"))","v":""},{"$f":"IF($B17=\"\",\"\",IFERROR(INDEX('quantities report_secondary'!$D$2:$D$10003,SMALL(IF('quantities report_secondary'!$A$2:$A$10003=AG$6,ROW('quantities report_secondary'!$A$2:$A$10003)-1,\"\"),ROWS($B$8:$B17))),\"0\"))","v":""},{"$f":"IF($B17=\"\",\"\",IFERROR(INDEX('quantities report_secondary'!$D$2:$D$10003,SMALL(IF('quantities report_secondary'!$A$2:$A$10003=AH$6,ROW('quantities report_secondary'!$A$2:$A$10003)-1,\"\"),ROWS($B$8:$B17))),\"0\"))","v":""},"","","","","",0.9,"",""]
[null,{"$f":"IFERROR(INDEX('manual inputs_secondary'!M:M,SMALL(IF('manual inputs_secondary'!M:M<>\"\",ROW('manual inputs_secondary'!M:M)),ROW(13:13))),\"\")","v":""},{"$f":"IF(B18=\"\",\"\",IFERROR(INDEX('quantities report_secondary'!$D$2:$D$10003,SMALL(IF('quantities report_secondary'!$A$2:$A$10003=C$6,ROW('quantities report_secondary'!$A$2:$A$10003)-1,\"\"),ROWS($B$8:$B18))),\"0\"))","v":""},"",null,"",{"$f":"IF($B18=\"\",\"\",Structure_Ex_Secondary!I18)","v":""},null,{"$f":"IF($B18=\"\",\"\",IFERROR(INDEX('quantities report_secondary'!$D$2:$D$10003,SMALL(IF('quantities report_secondary'!$A$2:$A$10003=I$6,ROW('quantities report_secondary'!$A$2:$A$10003)-1,\"\"),ROWS($B$8:$B18))),\"0\"))","v":""},{"$f":"IF($B18=\"\",\"\",[1]Removals_secondary!$F15)","v":""},{"$f":"IF($B18=\"\",\"\",Removals_Secondary!$K15)","v":""},{"$f":"IF($B18=\"\",\"\",IFERROR(INDEX('quantities report_secondary'!$D$2:$D$10003,SMALL(IF('quantities report_secondary'!$A$2:$A$10003=L$6,ROW('quantities report_secondary'!$A$2:$A$10003)-1,\"\"),ROWS($B$8:$B18))),\"0\"))","v":""},{"$f":"IF(B18=\"\",\"\",LOOKUP(B18,'manual inputs_secondary'!$B$4:$B$22,'manual inputs_secondary'!$D$4:$D$22))","v":""},"",{"$f":"IF($B18=\"\",\"\",IFERROR(INDEX('quantities report_secondary'!$D$2:$D$10003,SMALL(IF('quantities report_secondary'!$A$2:$A$10003=O$6,ROW('quantities report_secondary'!$A$2:$A$10003)-1,\"\"),ROWS($B$8:$B18))),\"0\"))","v":""},"",null,"",{"$f":"IF($B18=\"\",\"\",Backfill_Secondary!E18)","v":""},{"$f":"IF($B18=\"\",\"\",Backfill_Secondary!H18)","v":""},{"$f":"IF($B18=\"\",\"\",IFERROR(INDEX('quantities report_secondary'!$D$2:$D$10003,SMALL(IF('quantities report_secondary'!$A$2:$A$10003=U$6,ROW('quantities report_secondary'!$A$2:$A$10003)-1,\"\"),ROWS($B$8:$B18))),\"0\"))","v":""},{"$f":"IF($B18=\"\",\"\",IFERROR(INDEX('quantities report_secondary'!$D$2:$D$10003,SMALL(IF('quantities report_secondary'!$A$2:$A$10003=V$6,ROW('quantities report_secondary'!$A$2:$A$10003)-1,\"\"),ROWS($B$8:$B18))),\"0\"))","v":""},{"$f":"IF($B18=\"\",\"\",IFERROR(INDEX('quantities report_secondary'!$D$2:$D$10003,SMALL(IF('quantities report_secondary'!$A$2:$A$10003=W$6,ROW('quantities report_secondary'!$A$2:$A$10003)-1,\"\"),ROWS($B$8:$B18))),\"0\"))","v":""},{"$f":"IF($B18=\"\",\"\",IFERROR(INDEX('quantities report_secondary'!$D$2:$D$10003,SMALL(IF('quantities report_secondary'!$A$2:$A$10003=X$6,ROW('quantities report_secondary'!$A$2:$A$10003)-1,\"\"),ROWS($B$8:$B18))),\"0\"))","v":""},{"$f":"IF($B18=\"\",\"\",Backfill_Secondary!P18)","v":""},{"$f":"IF($B18=\"\",\"\",IFERROR(INDEX('quantities report_secondary'!$D$2:$D$10003,SMALL(IF('quantities report_secondary'!$A$2:$A$10003=Z$6,ROW('quantities report_secondary'!$A$2:$A$10003)-1,\"\"),ROWS($B$8:$B18))),\"0\"))","v":""},{"$f":"IF($B18=\"\",\"\",Removals_Secondary!$G15)","v":""},{"$f":"IF($B18=\"\",\"\",Removals_Secondary!$L15)","v":""},{"$f":"IF($B18=\"\",\"\",IFERROR(INDEX('quantities report_secondary'!$D$2:$D$10003,SMALL(IF('quantities report_secondary'!$A$2:$A$10003=AC$6,ROW('quantities report_secondary'!$A$2:$A$10003)-1,\"\"),ROWS($B$8:$B18))),\"0\"))","v":""},{"$f":"IF($B18=\"\",\"\",IFERROR(INDEX('quantities report_secondary'!$D$2:$D$10003,SMALL(IF('quantities report_secondary'!$A$2:$A$10003=AD$6,ROW('quantities report_secondary'!$A$2:$A$10003)-1,\"\"),ROWS($B$8:$B18))),\"0\"))","v":""},{"$f":"IF($B18=\"\",\"\",IFERROR(INDEX('quantities report_secondary'!$D$2:$D$10003,SMALL(IF('quantities report_secondary'!$A$2:$A$10003=AE$6,ROW('quantities report_secondary'!$A$2:$A$10003)-1,\"\"),ROWS($B$8:$B18))),\"0\"))","v":""},{"$f":"IF($B18=\"\",\"\",IFERROR(INDEX('quantities report_secondary'!$D$2:$D$10003,SMALL(IF('quantities report_secondary'!$A$2:$A$10003=AF$6,ROW('quantities report_secondary'!$A$2:$A$10003)-1,\"\"),ROWS($B$8:$B18))),\"0\"))","v":""},{"$f":"IF($B18=\"\",\"\",IFERROR(INDEX('quantities report_secondary'!$D$2:$D$10003,SMALL(IF('quantities report_secondary'!$A$2:$A$10003=AG$6,ROW('quantities report_secondary'!$A$2:$A$10003)-1,\"\"),ROWS($B$8:$B18))),\"0\"))","v":""},{"$f":"IF($B18=\"\",\"\",IFERROR(INDEX('quantities report_secondary'!$D$2:$D$10003,SMALL(IF('quantities report_secondary'!$A$2:$A$10003=AH$6,ROW('quantities report_secondary'!$A$2:$A$10003)-1,\"\"),ROWS($B$8:$B18))),\"0\"))","v":""},"","","","","",0.9,"",""]
[null,{"$f":"IFERROR(INDEX('manual inputs_secondary'!M:M,SMALL(IF('manual inputs_secondary'!M:M<>\"\",ROW('manual inputs_secondary'!M:M)),ROW(14:14))),\"\")","v":""},{"$f":"IF(B19=\"\",\"\",IFERROR(INDEX('quantities report_secondary'!$D$2:$D$10003,SMALL(IF('quantities report_secondary'!$A$2:$A$10003=C$6,ROW('quantities report_secondary'!$A$2:$A$10003)-1,\"\"),ROWS($B$8:$B19))),\"0\"))","v":""},"",null,"",{"$f":"IF($B19=\"\",\"\",Structure_Ex_Secondary!I19)","v":""},null,{"$f":"IF($B19=\"\",\"\",IFERROR(INDEX('quantities report_secondary'!$D$2:$D$10003,SMALL(IF('quantities report_secondary'!$A$2:$A$10003=I$6,ROW('quantities report_secondary'!$A$2:$A$10003)-1,\"\"),ROWS($B$8:$B19))),\"0\"))","v":""},{"$f":"IF($B19=\"\",\"\",[1]Removals_secondary!$F16)","v":""},{"$f":"IF($B19=\"\",\"\",Removals_Secondary!$K16)","v":""},{"$f":"IF($B19=\"\",\"\",IFERROR(INDEX('quantities report_secondary'!$D$2:$D$10003,SMALL(IF('quantities report_secondary'!$A$2:$A$10003=L$6,ROW('quantities report_secondary'!$A$2:$A$10003)-1,\"\"),ROWS($B$8:$B19))),\"0\"))","v":""},{"$f":"IF(B19=\"\",\"\",LOOKUP(B19,'manual inputs_secondary'!$B$4:$B$22,'manual inputs_secondary'!$D$4:$D$22))","v":""},"",{"$f":"IF($B19=\"\",\"\",IFERROR(INDEX('quantities report_secondary'!$D$2:$D$10003,SMALL(IF('quantities report_secondary'!$A$2:$A$10003=O$6,ROW('quantities report_secondary'!$A$2:$A$10003)-1,\"\"),ROWS($B$8:$B19))),\"0\"))","v":""},"",null,"",{"$f":"IF($B19=\"\",\"\",Backfill_Secondary!E19)","v":""},{"$f":"IF($B19=\"\",\"\",Backfill_Secondary!H19)","v":""},{"$f":"IF($B19=\"\",\"\",IFERROR(INDEX('quantities report_secondary'!$D$2:$D$10003,SMALL(IF('quantities report_secondary'!$A$2:$A$10003=U$6,ROW('quantities report_secondary'!$A$2:$A$10003)-1,\"\"),ROWS($B$8:$B19))),\"0\"))","v":""},{"$f":"IF($B19=\"\",\"\",IFERROR(INDEX('quantities report_secondary'!$D$2:$D$10003,SMALL(IF('quantities report_secondary'!$A$2:$A$10003=V$6,ROW('quantities report_secondary'!$A$2:$A$10003)-1,\"\"),ROWS($B$8:$B19))),\"0\"))","v":""},{"$f":"IF($B19=\"\",\"\",IFERROR(INDEX('quantities report_secondary'!$D$2:$D$10003,SMALL(IF('quantities report_secondary'!$A$2:$A$10003=W$6,ROW('quantities report_secondary'!$A$2:$A$10003)-1,\"\"),ROWS($B$8:$B19))),\"0\"))","v":""},{"$f":"IF($B19=\"\",\"\",IFERROR(INDEX('quantities report_secondary'!$D$2:$D$10003,SMALL(IF('quantities report_secondary'!$A$2:$A$10003=X$6,ROW('quantities report_secondary'!$A$2:$A$10003)-1,\"\"),ROWS($B$8:$B19))),\"0\"))","v":""},{"$f":"IF($B19=\"\",\"\",Backfill_Secondary!P19)","v":""},{"$f":"IF($B19=\"\",\"\",IFERROR(INDEX('quantities report_secondary'!$D$2:$D$10003,SMALL(IF('quantities report_secondary'!$A$2:$A$10003=Z$6,ROW('quantities report_secondary'!$A$2:$A$10003)-1,\"\"),ROWS($B$8:$B19))),\"0\"))","v":""},{"$f":"IF($B19=\"\",\"\",Removals_Secondary!$G16)","v":""},{"$f":"IF($B19=\"\",\"\",Removals_Secondary!$L16)","v":""},{"$f":"IF($B19=\"\",\"\",IFERROR(INDEX('quantities report_secondary'!$D$2:$D$10003,SMALL(IF('quantities report_secondary'!$A$2:$A$10003=AC$6,ROW('quantities report_secondary'!$A$2:$A$10003)-1,\"\"),ROWS($B$8:$B19))),\"0\"))","v":""},{"$f":"IF($B19=\"\",\"\",IFERROR(INDEX('quantities report_secondary'!$D$2:$D$10003,SMALL(IF('quantities report_secondary'!$A$2:$A$10003=AD$6,ROW('quantities report_secondary'!$A$2:$A$10003)-1,\"\"),ROWS($B$8:$B19))),\"0\"))","v":""},{"$f":"IF($B19=\"\",\"\",IFERROR(INDEX('quantities report_secondary'!$D$2:$D$10003,SMALL(IF('quantities report_secondary'!$A$2:$A$10003=AE$6,ROW('quantities report_secondary'!$A$2:$A$10003)-1,\"\"),ROWS($B$8:$B19))),\"0\"))","v":""},{"$f":"IF($B19=\"\",\"\",IFERROR(INDEX('quantities report_secondary'!$D$2:$D$10003,SMALL(IF('quantities report_secondary'!$A$2:$A$10003=AF$6,ROW('quantities report_secondary'!$A$2:$A$10003)-1,\"\"),ROWS($B$8:$B19))),\"0\"))","v":""},{"$f":"IF($B19=\"\",\"\",IFERROR(INDEX('quantities report_secondary'!$D$2:$D$10003,SMALL(IF('quantities report_secondary'!$A$2:$A$10003=AG$6,ROW('quantities report_secondary'!$A$2:$A$10003)-1,\"\"),ROWS($B$8:$B19))),\"0\"))","v":""},{"$f":"IF($B19=\"\",\"\",IFERROR(INDEX('quantities report_secondary'!$D$2:$D$10003,SMALL(IF('quantities report_secondary'!$A$2:$A$10003=AH$6,ROW('quantities report_secondary'!$A$2:$A$10003)-1,\"\"),ROWS($B$8:$B19))),\"0\"))","v":""},"","","","","",0.9,"",""]
[null,{"$f":"IFERROR(INDEX('manual inputs_secondary'!M:M,SMALL(IF('manual inputs_secondary'!M:M<>\"\",ROW('manual inputs_secondary'!M:M)),ROW(15:15))),\"\")","v":""},{"$f":"IF(B20=\"\",\"\",IFERROR(INDEX('quantities report_secondary'!$D$2:$D$10003,SMALL(IF('quantities report_secondary'!$A$2:$A$10003=C$6,ROW('quantities report_secondary'!$A$2:$A$10003)-1,\"\"),ROWS($B$8:$B20))),\"0\"))","v":""},"",null,"",{"$f":"IF($B20=\"\",\"\",Structure_Ex_Secondary!I20)","v":""},null,{"$f":"IF($B20=\"\",\"\",IFERROR(INDEX('quantities report_secondary'!$D$2:$D$10003,SMALL(IF('quantities report_secondary'!$A$2:$A$10003=I$6,ROW('quantities report_secondary'!$A$2:$A$10003)-1,\"\"),ROWS($B$8:$B20))),\"0\"))","v":""},{"$f":"IF($B20=\"\",\"\",[1]Removals_secondary!$F17)","v":""},{"$f":"IF($B20=\"\",\"\",Removals_Secondary!$K17)","v":""},{"$f":"IF($B20=\"\",\"\",IFERROR(INDEX('quantities report_secondary'!$D$2:$D$10003,SMALL(IF('quantities report_secondary'!$A$2:$A$10003=L$6,ROW('quantities report_secondary'!$A$2:$A$10003)-1,\"\"),ROWS($B$8:$B20))),\"0\"))","v":""},{"$f":"IF(B20=\"\",\"\",LOOKUP(B20,'manual inputs_secondary'!$B$4:$B$22,'manual inputs_secondary'!$D$4:$D$22))","v":""},"",{"$f":"IF($B20=\"\",\"\",IFERROR(INDEX('quantities report_secondary'!$D$2:$D$10003,SMALL(IF('quantities report_secondary'!$A$2:$A$10003=O$6,ROW('quantities report_secondary'!$A$2:$A$10003)-1,\"\"),ROWS($B$8:$B20))),\"0\"))","v":""},"",null,"",{"$f":"IF($B20=\"\",\"\",Backfill_Secondary!E20)","v":""},{"$f":"IF($B20=\"\",\"\",Backfill_Secondary!H20)","v":""},{"$f":"IF($B20=\"\",\"\",IFERROR(INDEX('quantities report_secondary'!$D$2:$D$10003,SMALL(IF('quantities report_secondary'!$A$2:$A$10003=U$6,ROW('quantities report_secondary'!$A$2:$A$10003)-1,\"\"),ROWS($B$8:$B20))),\"0\"))","v":""},{"$f":"IF($B20=\"\",\"\",IFERROR(INDEX('quantities report_secondary'!$D$2:$D$10003,SMALL(IF('quantities report_secondary'!$A$2:$A$10003=V$6,ROW('quantities report_secondary'!$A$2:$A$10003)-1,\"\"),ROWS($B$8:$B20))),\"0\"))","v":""},{"$f":"IF($B20=\"\",\"\",IFERROR(INDEX('quantities report_secondary'!$D$2:$D$10003,SMALL(IF('quantities report_secondary'!$A$2:$A$10003=W$6,ROW('quantities report_secondary'!$A$2:$A$10003)-1,\"\"),ROWS($B$8:$B20))),\"0\"))","v":""},{"$f":"IF($B20=\"\",\"\",IFERROR(INDEX('quantities report_secondary'!$D$2:$D$10003,SMALL(IF('quantities report_secondary'!$A$2:$A$10003=X$6,ROW('quantities report_secondary'!$A$2:$A$10003)-1,\"\"),ROWS($B$8:$B20))),\"0\"))","v":""},{"$f":"IF($B20=\"\",\"\",Backfill_Secondary!P20)","v":""},{"$f":"IF($B20=\"\",\"\",IFERROR(INDEX('quantities report_secondary'!$D$2:$D$10003,SMALL(IF('quantities report_secondary'!$A$2:$A$10003=Z$6,ROW('quantities report_secondary'!$A$2:$A$10003)-1,\"\"),ROWS($B$8:$B20))),\"0\"))","v":""},{"$f":"IF($B20=\"\",\"\",Removals_Secondary!$G17)","v":""},{"$f":"IF($B20=\"\",\"\",Removals_Secondary!$L17)","v":""},{"$f":"IF($B20=\"\",\"\",IFERROR(INDEX('quantities report_secondary'!$D$2:$D$10003,SMALL(IF('quantities report_secondary'!$A$2:$A$10003=AC$6,ROW('quantities report_secondary'!$A$2:$A$10003)-1,\"\"),ROWS($B$8:$B20))),\"0\"))","v":""},{"$f":"IF($B20=\"\",\"\",IFERROR(INDEX('quantities report_secondary'!$D$2:$D$10003,SMALL(IF('quantities report_secondary'!$A$2:$A$10003=AD$6,ROW('quantities report_secondary'!$A$2:$A$10003)-1,\"\"),ROWS($B$8:$B20))),\"0\"))","v":""},{"$f":"IF($B20=\"\",\"\",IFERROR(INDEX('quantities report_secondary'!$D$2:$D$10003,SMALL(IF('quantities report_secondary'!$A$2:$A$10003=AE$6,ROW('quantities report_secondary'!$A$2:$A$10003)-1,\"\"),ROWS($B$8:$B20))),\"0\"))","v":""},{"$f":"IF($B20=\"\",\"\",IFERROR(INDEX('quantities report_secondary'!$D$2:$D$10003,SMALL(IF('quantities report_secondary'!$A$2:$A$10003=AF$6,ROW('quantities report_secondary'!$A$2:$A$10003)-1,\"\"),ROWS($B$8:$B20))),\"0\"))","v":""},{"$f":"IF($B20=\"\",\"\",IFERROR(INDEX('quantities report_secondary'!$D$2:$D$10003,SMALL(IF('quantities report_secondary'!$A$2:$A$10003=AG$6,ROW('quantities report_secondary'!$A$2:$A$10003)-1,\"\"),ROWS($B$8:$B20))),\"0\"))","v":""},{"$f":"IF($B20=\"\",\"\",IFERROR(INDEX('quantities report_secondary'!$D$2:$D$10003,SMALL(IF('quantities report_secondary'!$A$2:$A$10003=AH$6,ROW('quantities report_secondary'!$A$2:$A$10003)-1,\"\"),ROWS($B$8:$B20))),\"0\"))","v":""},"","","","","",0.9,"",""]
[null,{"$f":"IFERROR(INDEX('manual inputs_secondary'!M:M,SMALL(IF('manual inputs_secondary'!M:M<>\"\",ROW('manual inputs_secondary'!M:M)),ROW(16:16))),\"\")","v":""},{"$f":"IF(B21=\"\",\"\",IFERROR(INDEX('quantities report_secondary'!$D$2:$D$10003,SMALL(IF('quantities report_secondary'!$A$2:$A$10003=C$6,ROW('quantities report_secondary'!$A$2:$A$10003)-1,\"\"),ROWS($B$8:$B21))),\"0\"))","v":""},"",null,"",{"$f":"IF($B21=\"\",\"\",Structure_Ex_Secondary!I21)","v":""},null,{"$f":"IF($B21=\"\",\"\",IFERROR(INDEX('quantities report_secondary'!$D$2:$D$10003,SMALL(IF('quantities report_secondary'!$A$2:$A$10003=I$6,ROW('quantities report_secondary'!$A$2:$A$10003)-1,\"\"),ROWS($B$8:$B21))),\"0\"))","v":""},{"$f":"IF($B21=\"\",\"\",[1]Removals_secondary!$F18)","v":""},{"$f":"IF($B21=\"\",\"\",Removals_Secondary!$K18)","v":""},{"$f":"IF($B21=\"\",\"\",IFERROR(INDEX('quantities report_secondary'!$D$2:$D$10003,SMALL(IF('quantities report_secondary'!$A$2:$A$10003=L$6,ROW('quantities report_secondary'!$A$2:$A$10003)-1,\"\"),ROWS($B$8:$B21))),\"0\"))","v":""},{"$f":"IF(B21=\"\",\"\",LOOKUP(B21,'manual inputs_secondary'!$B$4:$B$22,'manual inputs_secondary'!$D$4:$D$22))","v":""},"",{"$f":"IF($B21=\"\",\"\",IFERROR(INDEX('quantities report_secondary'!$D$2:$D$10003,SMALL(IF('quantities report_secondary'!$A$2:$A$10003=O$6,ROW('quantities report_secondary'!$A$2:$A$10003)-1,\"\"),ROWS($B$8:$B21))),\"0\"))","v":""},"",null,"",{"$f":"IF($B21=\"\",\"\",Backfill_Secondary!E21)","v":""},{"$f":"IF($B21=\"\",\"\",Backfill_Secondary!H21)","v":""},{"$f":"IF($B21=\"\",\"\",IFERROR(INDEX('quantities report_secondary'!$D$2:$D$10003,SMALL(IF('quantities report_secondary'!$A$2:$A$10003=U$6,ROW('quantities report_secondary'!$A$2:$A$10003)-1,\"\"),ROWS($B$8:$B21))),\"0\"))","v":""},{"$f":"IF($B21=\"\",\"\",IFERROR(INDEX('quantities report_secondary'!$D$2:$D$10003,SMALL(IF('quantities report_secondary'!$A$2:$A$10003=V$6,ROW('quantities report_secondary'!$A$2:$A$10003)-1,\"\"),ROWS($B$8:$B21))),\"0\"))","v":""},{"$f":"IF($B21=\"\",\"\",IFERROR(INDEX('quantities report_secondary'!$D$2:$D$10003,SMALL(IF('quantities report_secondary'!$A$2:$A$10003=W$6,ROW('quantities report_secondary'!$A$2:$A$10003)-1,\"\"),ROWS($B$8:$B21))),\"0\"))","v":""},{"$f":"IF($B21=\"\",\"\",IFERROR(INDEX('quantities report_secondary'!$D$2:$D$10003,SMALL(IF('quantities report_secondary'!$A$2:$A$10003=X$6,ROW('quantities report_secondary'!$A$2:$A$10003)-1,\"\"),ROWS($B$8:$B21))),\"0\"))","v":""},{"$f":"IF($B21=\"\",\"\",Backfill_Secondary!P21)","v":""},{"$f":"IF($B21=\"\",\"\",IFERROR(INDEX('quantities report_secondary'!$D$2:$D$10003,SMALL(IF('quantities report_secondary'!$A$2:$A$10003=Z$6,ROW('quantities report_secondary'!$A$2:$A$10003)-1,\"\"),ROWS($B$8:$B21))),\"0\"))","v":""},{"$f":"IF($B21=\"\",\"\",Removals_Secondary!$G18)","v":""},{"$f":"IF($B21=\"\",\"\",Removals_Secondary!$L18)","v":""},{"$f":"IF($B21=\"\",\"\",IFERROR(INDEX('quantities report_secondary'!$D$2:$D$10003,SMALL(IF('quantities report_secondary'!$A$2:$A$10003=AC$6,ROW('quantities report_secondary'!$A$2:$A$10003)-1,\"\"),ROWS($B$8:$B21))),\"0\"))","v":""},{"$f":"IF($B21=\"\",\"\",IFERROR(INDEX('quantities report_secondary'!$D$2:$D$10003,SMALL(IF('quantities report_secondary'!$A$2:$A$10003=AD$6,ROW('quantities report_secondary'!$A$2:$A$10003)-1,\"\"),ROWS($B$8:$B21))),\"0\"))","v":""},{"$f":"IF($B21=\"\",\"\",IFERROR(INDEX('quantities report_secondary'!$D$2:$D$10003,SMALL(IF('quantities report_secondary'!$A$2:$A$10003=AE$6,ROW('quantities report_secondary'!$A$2:$A$10003)-1,\"\"),ROWS($B$8:$B21))),\"0\"))","v":""},{"$f":"IF($B21=\"\",\"\",IFERROR(INDEX('quantities report_secondary'!$D$2:$D$10003,SMALL(IF('quantities report_secondary'!$A$2:$A$10003=AF$6,ROW('quantities report_secondary'!$A$2:$A$10003)-1,\"\"),ROWS($B$8:$B21))),\"0\"))","v":""},{"$f":"IF($B21=\"\",\"\",IFERROR(INDEX('quantities report_secondary'!$D$2:$D$10003,SMALL(IF('quantities report_secondary'!$A$2:$A$10003=AG$6,ROW('quantities report_secondary'!$A$2:$A$10003)-1,\"\"),ROWS($B$8:$B21))),\"0\"))","v":""},{"$f":"IF($B21=\"\",\"\",IFERROR(INDEX('quantities report_secondary'!$D$2:$D$10003,SMALL(IF('quantities report_secondary'!$A$2:$A$10003=AH$6,ROW('quantities report_secondary'!$A$2:$A$10003)-1,\"\"),ROWS($B$8:$B21))),\"0\"))","v":""},"","","","","",0.9,"",""]
[null,{"$f":"IFERROR(INDEX('manual inputs_secondary'!M:M,SMALL(IF('manual inputs_secondary'!M:M<>\"\",ROW('manual inputs_secondary'!M:M)),ROW(17:17))),\"\")","v":""},{"$f":"IF(B22=\"\",\"\",IFERROR(INDEX('quantities report_secondary'!$D$2:$D$10003,SMALL(IF('quantities report_secondary'!$A$2:$A$10003=C$6,ROW('quantities report_secondary'!$A$2:$A$10003)-1,\"\"),ROWS($B$8:$B22))),\"0\"))","v":""},"",null,"",{"$f":"IF($B22=\"\",\"\",Structure_Ex_Secondary!I22)","v":""},null,{"$f":"IF($B22=\"\",\"\",IFERROR(INDEX('quantities report_secondary'!$D$2:$D$10003,SMALL(IF('quantities report_secondary'!$A$2:$A$10003=I$6,ROW('quantities report_secondary'!$A$2:$A$10003)-1,\"\"),ROWS($B$8:$B22))),\"0\"))","v":""},{"$f":"IF($B22=\"\",\"\",[1]Removals_secondary!$F19)","v":""},{"$f":"IF($B22=\"\",\"\",Removals_Secondary!$K19)","v":""},{"$f":"IF($B22=\"\",\"\",IFERROR(INDEX('quantities report_secondary'!$D$2:$D$10003,SMALL(IF('quantities report_secondary'!$A$2:$A$10003=L$6,ROW('quantities report_secondary'!$A$2:$A$10003)-1,\"\"),ROWS($B$8:$B22))),\"0\"))","v":""},{"$f":"IF(B22=\"\",\"\",LOOKUP(B22,'manual inputs_secondary'!$B$4:$B$22,'manual inputs_secondary'!$D$4:$D$22))","v":""},"",{"$f":"IF($B22=\"\",\"\",IFERROR(INDEX('quantities report_secondary'!$D$2:$D$10003,SMALL(IF('quantities report_secondary'!$A$2:$A$10003=O$6,ROW('quantities report_secondary'!$A$2:$A$10003)-1,\"\"),ROWS($B$8:$B22))),\"0\"))","v":""},"",null,"",{"$f":"IF($B22=\"\",\"\",Backfill_Secondary!E22)","v":""},{"$f":"IF($B22=\"\",\"\",Backfill_Secondary!H22)","v":""},{"$f":"IF($B22=\"\",\"\",IFERROR(INDEX('quantities report_secondary'!$D$2:$D$10003,SMALL(IF('quantities report_secondary'!$A$2:$A$10003=U$6,ROW('quantities report_secondary'!$A$2:$A$10003)-1,\"\"),ROWS($B$8:$B22))),\"0\"))","v":""},{"$f":"IF($B22=\"\",\"\",IFERROR(INDEX('quantities report_secondary'!$D$2:$D$10003,SMALL(IF('quantities report_secondary'!$A$2:$A$10003=V$6,ROW('quantities report_secondary'!$A$2:$A$10003)-1,\"\"),ROWS($B$8:$B22))),\"0\"))","v":""},{"$f":"IF($B22=\"\",\"\",IFERROR(INDEX('quantities report_secondary'!$D$2:$D$10003,SMALL(IF('quantities report_secondary'!$A$2:$A$10003=W$6,ROW('quantities report_secondary'!$A$2:$A$10003)-1,\"\"),ROWS($B$8:$B22))),\"0\"))","v":""},{"$f":"IF($B22=\"\",\"\",IFERROR(INDEX('quantities report_secondary'!$D$2:$D$10003,SMALL(IF('quantities report_secondary'!$A$2:$A$10003=X$6,ROW('quantities report_secondary'!$A$2:$A$10003)-1,\"\"),ROWS($B$8:$B22))),\"0\"))","v":""},{"$f":"IF($B22=\"\",\"\",Backfill_Secondary!P22)","v":""},{"$f":"IF($B22=\"\",\"\",IFERROR(INDEX('quantities report_secondary'!$D$2:$D$10003,SMALL(IF('quantities report_secondary'!$A$2:$A$10003=Z$6,ROW('quantities report_secondary'!$A$2:$A$10003)-1,\"\"),ROWS($B$8:$B22))),\"0\"))","v":""},{"$f":"IF($B22=\"\",\"\",Removals_Secondary!$G19)","v":""},{"$f":"IF($B22=\"\",\"\",Removals_Secondary!$L19)","v":""},{"$f":"IF($B22=\"\",\"\",IFERROR(INDEX('quantities report_secondary'!$D$2:$D$10003,SMALL(IF('quantities report_secondary'!$A$2:$A$10003=AC$6,ROW('quantities report_secondary'!$A$2:$A$10003)-1,\"\"),ROWS($B$8:$B22))),\"0\"))","v":""},{"$f":"IF($B22=\"\",\"\",IFERROR(INDEX('quantities report_secondary'!$D$2:$D$10003,SMALL(IF('quantities report_secondary'!$A$2:$A$10003=AD$6,ROW('quantities report_secondary'!$A$2:$A$10003)-1,\"\"),ROWS($B$8:$B22))),\"0\"))","v":""},{"$f":"IF($B22=\"\",\"\",IFERROR(INDEX('quantities report_secondary'!$D$2:$D$10003,SMALL(IF('quantities report_secondary'!$A$2:$A$10003=AE$6,ROW('quantities report_secondary'!$A$2:$A$10003)-1,\"\"),ROWS($B$8:$B22))),\"0\"))","v":""},{"$f":"IF($B22=\"\",\"\",IFERROR(INDEX('quantities report_secondary'!$D$2:$D$10003,SMALL(IF('quantities report_secondary'!$A$2:$A$10003=AF$6,ROW('quantities report_secondary'!$A$2:$A$10003)-1,\"\"),ROWS($B$8:$B22))),\"0\"))","v":""},{"$f":"IF($B22=\"\",\"\",IFERROR(INDEX('quantities report_secondary'!$D$2:$D$10003,SMALL(IF('quantities report_secondary'!$A$2:$A$10003=AG$6,ROW('quantities report_secondary'!$A$2:$A$10003)-1,\"\"),ROWS($B$8:$B22))),\"0\"))","v":""},{"$f":"IF($B22=\"\",\"\",IFERROR(INDEX('quantities report_secondary'!$D$2:$D$10003,SMALL(IF('quantities report_secondary'!$A$2:$A$10003=AH$6,ROW('quantities report_secondary'!$A$2:$A$10003)-1,\"\"),ROWS($B$8:$B22))),\"0\"))","v":""},"","","","","",0.9,"",""]
[null,{"$f":"IFERROR(INDEX('manual inputs_secondary'!M:M,SMALL(IF('manual inputs_secondary'!M:M<>\"\",ROW('manual inputs_secondary'!M:M)),ROW(18:18))),\"\")","v":""},{"$f":"IF(B23=\"\",\"\",IFERROR(INDEX('quantities report_secondary'!$D$2:$D$10003,SMALL(IF('quantities report_secondary'!$A$2:$A$10003=C$6,ROW('quantities report_secondary'!$A$2:$A$10003)-1,\"\"),ROWS($B$8:$B23))),\"0\"))","v":""},"",null,"",{"$f":"IF($B23=\"\",\"\",Structure_Ex_Secondary!I23)","v":""},null,{"$f":"IF($B23=\"\",\"\",IFERROR(INDEX('quantities report_secondary'!$D$2:$D$10003,SMALL(IF('quantities report_secondary'!$A$2:$A$10003=I$6,ROW('quantities report_secondary'!$A$2:$A$10003)-1,\"\"),ROWS($B$8:$B23))),\"0\"))","v":""},{"$f":"IF($B23=\"\",\"\",[1]Removals_secondary!$F20)","v":""},{"$f":"IF($B23=\"\",\"\",Removals_Secondary!$K20)","v":""},{"$f":"IF($B23=\"\",\"\",IFERROR(INDEX('quantities report_secondary'!$D$2:$D$10003,SMALL(IF('quantities report_secondary'!$A$2:$A$10003=L$6,ROW('quantities report_secondary'!$A$2:$A$10003)-1,\"\"),ROWS($B$8:$B23))),\"0\"))","v":""},{"$f":"IF(B23=\"\",\"\",LOOKUP(B23,'manual inputs_secondary'!$B$4:$B$22,'manual inputs_secondary'!$D$4:$D$22))","v":""},"",{"$f":"IF($B23=\"\",\"\",IFERROR(INDEX('quantities report_secondary'!$D$2:$D$10003,SMALL(IF('quantities report_secondary'!$A$2:$A$10003=O$6,ROW('quantities report_secondary'!$A$2:$A$10003)-1,\"\"),ROWS($B$8:$B23))),\"0\"))","v":""},"",null,"",{"$f":"IF($B23=\"\",\"\",Backfill_Secondary!E23)","v":""},{"$f":"IF($B23=\"\",\"\",Backfill_Secondary!H23)","v":""},{"$f":"IF($B23=\"\",\"\",IFERROR(INDEX('quantities report_secondary'!$D$2:$D$10003,SMALL(IF('quantities report_secondary'!$A$2:$A$10003=U$6,ROW('quantities report_secondary'!$A$2:$A$10003)-1,\"\"),ROWS($B$8:$B23))),\"0\"))","v":""},{"$f":"IF($B23=\"\",\"\",IFERROR(INDEX('quantities report_secondary'!$D$2:$D$10003,SMALL(IF('quantities report_secondary'!$A$2:$A$10003=V$6,ROW('quantities report_secondary'!$A$2:$A$10003)-1,\"\"),ROWS($B$8:$B23))),\"0\"))","v":""},{"$f":"IF($B23=\"\",\"\",IFERROR(INDEX('quantities report_secondary'!$D$2:$D$10003,SMALL(IF('quantities report_secondary'!$A$2:$A$10003=W$6,ROW('quantities report_secondary'!$A$2:$A$10003)-1,\"\"),ROWS($B$8:$B23))),\"0\"))","v":""},{"$f":"IF($B23=\"\",\"\",IFERROR(INDEX('quantities report_secondary'!$D$2:$D$10003,SMALL(IF('quantities report_secondary'!$A$2:$A$10003=X$6,ROW('quantities report_secondary'!$A$2:$A$10003)-1,\"\"),ROWS($B$8:$B23))),\"0\"))","v":""},{"$f":"IF($B23=\"\",\"\",Backfill_Secondary!P23)","v":""},{"$f":"IF($B23=\"\",\"\",IFERROR(INDEX('quantities report_secondary'!$D$2:$D$10003,SMALL(IF('quantities report_secondary'!$A$2:$A$10003=Z$6,ROW('quantities report_secondary'!$A$2:$A$10003)-1,\"\"),ROWS($B$8:$B23))),\"0\"))","v":""},{"$f":"IF($B23=\"\",\"\",Removals_Secondary!$G20)","v":""},{"$f":"IF($B23=\"\",\"\",Removals_Secondary!$L20)","v":""},{"$f":"IF($B23=\"\",\"\",IFERROR(INDEX('quantities report_secondary'!$D$2:$D$10003,SMALL(IF('quantities report_secondary'!$A$2:$A$10003=AC$6,ROW('quantities report_secondary'!$A$2:$A$10003)-1,\"\"),ROWS($B$8:$B23))),\"0\"))","v":""},{"$f":"IF($B23=\"\",\"\",IFERROR(INDEX('quantities report_secondary'!$D$2:$D$10003,SMALL(IF('quantities report_secondary'!$A$2:$A$10003=AD$6,ROW('quantities report_secondary'!$A$2:$A$10003)-1,\"\"),ROWS($B$8:$B23))),\"0\"))","v":""},{"$f":"IF($B23=\"\",\"\",IFERROR(INDEX('quantities report_secondary'!$D$2:$D$10003,SMALL(IF('quantities report_secondary'!$A$2:$A$10003=AE$6,ROW('quantities report_secondary'!$A$2:$A$10003)-1,\"\"),ROWS($B$8:$B23))),\"0\"))","v":""},{"$f":"IF($B23=\"\",\"\",IFERROR(INDEX('quantities report_secondary'!$D$2:$D$10003,SMALL(IF('quantities report_secondary'!$A$2:$A$10003=AF$6,ROW('quantities report_secondary'!$A$2:$A$10003)-1,\"\"),ROWS($B$8:$B23))),\"0\"))","v":""},{"$f":"IF($B23=\"\",\"\",IFERROR(INDEX('quantities report_secondary'!$D$2:$D$10003,SMALL(IF('quantities report_secondary'!$A$2:$A$10003=AG$6,ROW('quantities report_secondary'!$A$2:$A$10003)-1,\"\"),ROWS($B$8:$B23))),\"0\"))","v":""},{"$f":"IF($B23=\"\",\"\",IFERROR(INDEX('quantities report_secondary'!$D$2:$D$10003,SMALL(IF('quantities report_secondary'!$A$2:$A$10003=AH$6,ROW('quantities report_secondary'!$A$2:$A$10003)-1,\"\"),ROWS($B$8:$B23))),\"0\"))","v":""},"","","","","",0.9,"",""]
[null,{"$f":"IFERROR(INDEX('manual inputs_secondary'!M:M,SMALL(IF('manual inputs_secondary'!M:M<>\"\",ROW('manual inputs_secondary'!M:M)),ROW(19:19))),\"\")","v":""},{"$f":"IF(B24=\"\",\"\",IFERROR(INDEX('quantities report_secondary'!$D$2:$D$10003,SMALL(IF('quantities report_secondary'!$A$2:$A$10003=C$6,ROW('quantities report_secondary'!$A$2:$A$10003)-1,\"\"),ROWS($B$8:$B24))),\"0\"))","v":""},"",null,"",{"$f":"IF($B24=\"\",\"\",Structure_Ex_Secondary!I24)","v":""},null,{"$f":"IF($B24=\"\",\"\",IFERROR(INDEX('quantities report_secondary'!$D$2:$D$10003,SMALL(IF('quantities report_secondary'!$A$2:$A$10003=I$6,ROW('quantities report_secondary'!$A$2:$A$10003)-1,\"\"),ROWS($B$8:$B24))),\"0\"))","v":""},{"$f":"IF($B24=\"\",\"\",[1]Removals_secondary!$F21)","v":""},{"$f":"IF($B24=\"\",\"\",Removals_Secondary!$K21)","v":""},{"$f":"IF($B24=\"\",\"\",IFERROR(INDEX('quantities report_secondary'!$D$2:$D$10003,SMALL(IF('quantities report_secondary'!$A$2:$A$10003=L$6,ROW('quantities report_secondary'!$A$2:$A$10003)-1,\"\"),ROWS($B$8:$B24))),\"0\"))","v":""},{"$f":"IF(B24=\"\",\"\",LOOKUP(B24,'manual inputs_secondary'!$B$4:$B$22,'manual inputs_secondary'!$D$4:$D$22))","v":""},"",{"$f":"IF($B24=\"\",\"\",IFERROR(INDEX('quantities report_secondary'!$D$2:$D$10003,SMALL(IF('quantities report_secondary'!$A$2:$A$10003=O$6,ROW('quantities report_secondary'!$A$2:$A$10003)-1,\"\"),ROWS($B$8:$B24))),\"0\"))","v":""},"",null,"",{"$f":"IF($B24=\"\",\"\",Backfill_Secondary!E24)","v":""},{"$f":"IF($B24=\"\",\"\",Backfill_Secondary!H24)","v":""},{"$f":"IF($B24=\"\",\"\",IFERROR(INDEX('quantities report_secondary'!$D$2:$D$10003,SMALL(IF('quantities report_secondary'!$A$2:$A$10003=U$6,ROW('quantities report_secondary'!$A$2:$A$10003)-1,\"\"),ROWS($B$8:$B24))),\"0\"))","v":""},{"$f":"IF($B24=\"\",\"\",IFERROR(INDEX('quantities report_secondary'!$D$2:$D$10003,SMALL(IF('quantities report_secondary'!$A$2:$A$10003=V$6,ROW('quantities report_secondary'!$A$2:$A$10003)-1,\"\"),ROWS($B$8:$B24))),\"0\"))","v":""},{"$f":"IF($B24=\"\",\"\",IFERROR(INDEX('quantities report_secondary'!$D$2:$D$10003,SMALL(IF('quantities report_secondary'!$A$2:$A$10003=W$6,ROW('quantities report_secondary'!$A$2:$A$10003)-1,\"\"),ROWS($B$8:$B24))),\"0\"))","v":""},{"$f":"IF($B24=\"\",\"\",IFERROR(INDEX('quantities report_secondary'!$D$2:$D$10003,SMALL(IF('quantities report_secondary'!$A$2:$A$10003=X$6,ROW('quantities report_secondary'!$A$2:$A$10003)-1,\"\"),ROWS($B$8:$B24))),\"0\"))","v":""},{"$f":"IF($B24=\"\",\"\",Backfill_Secondary!P24)","v":""},{"$f":"IF($B24=\"\",\"\",IFERROR(INDEX('quantities report_secondary'!$D$2:$D$10003,SMALL(IF('quantities report_secondary'!$A$2:$A$10003=Z$6,ROW('quantities report_secondary'!$A$2:$A$10003)-1,\"\"),ROWS($B$8:$B24))),\"0\"))","v":""},{"$f":"IF($B24=\"\",\"\",Removals_Secondary!$G21)","v":""},{"$f":"IF($B24=\"\",\"\",Removals_Secondary!$L21)","v":""},{"$f":"IF($B24=\"\",\"\",IFERROR(INDEX('quantities report_secondary'!$D$2:$D$10003,SMALL(IF('quantities report_secondary'!$A$2:$A$10003=AC$6,ROW('quantities report_secondary'!$A$2:$A$10003)-1,\"\"),ROWS($B$8:$B24))),\"0\"))","v":""},{"$f":"IF($B24=\"\",\"\",IFERROR(INDEX('quantities report_secondary'!$D$2:$D$10003,SMALL(IF('quantities report_secondary'!$A$2:$A$10003=AD$6,ROW('quantities report_secondary'!$A$2:$A$10003)-1,\"\"),ROWS($B$8:$B24))),\"0\"))","v":""},{"$f":"IF($B24=\"\",\"\",IFERROR(INDEX('quantities report_secondary'!$D$2:$D$10003,SMALL(IF('quantities report_secondary'!$A$2:$A$10003=AE$6,ROW('quantities report_secondary'!$A$2:$A$10003)-1,\"\"),ROWS($B$8:$B24))),\"0\"))","v":""},{"$f":"IF($B24=\"\",\"\",IFERROR(INDEX('quantities report_secondary'!$D$2:$D$10003,SMALL(IF('quantities report_secondary'!$A$2:$A$10003=AF$6,ROW('quantities report_secondary'!$A$2:$A$10003)-1,\"\"),ROWS($B$8:$B24))),\"0\"))","v":""},{"$f":"IF($B24=\"\",\"\",IFERROR(INDEX('quantities report_secondary'!$D$2:$D$10003,SMALL(IF('quantities report_secondary'!$A$2:$A$10003=AG$6,ROW('quantities report_secondary'!$A$2:$A$10003)-1,\"\"),ROWS($B$8:$B24))),\"0\"))","v":""},{"$f":"IF($B24=\"\",\"\",IFERROR(INDEX('quantities report_secondary'!$D$2:$D$10003,SMALL(IF('quantities report_secondary'!$A$2:$A$10003=AH$6,ROW('quantities report_secondary'!$A$2:$A$10003)-1,\"\"),ROWS($B$8:$B24))),\"0\"))","v":""},"","","","","",0.9,"",""]
[null,{"$f":"IFERROR(INDEX('manual inputs_secondary'!M:M,SMALL(IF('manual inputs_secondary'!M:M<>\"\",ROW('manual inputs_secondary'!M:M)),ROW(20:20))),\"\")","v":""},{"$f":"IF(B25=\"\",\"\",IFERROR(INDEX('quantities report_secondary'!$D$2:$D$10003,SMALL(IF('quantities report_secondary'!$A$2:$A$10003=C$6,ROW('quantities report_secondary'!$A$2:$A$10003)-1,\"\"),ROWS($B$8:$B25))),\"0\"))","v":""},"",null,"",{"$f":"IF($B25=\"\",\"\",Structure_Ex_Secondary!I25)","v":""},null,{"$f":"IF($B25=\"\",\"\",IFERROR(INDEX('quantities report_secondary'!$D$2:$D$10003,SMALL(IF('quantities report_secondary'!$A$2:$A$10003=I$6,ROW('quantities report_secondary'!$A$2:$A$10003)-1,\"\"),ROWS($B$8:$B25))),\"0\"))","v":""},{"$f":"IF($B25=\"\",\"\",[1]Removals_secondary!$F22)","v":""},{"$f":"IF($B25=\"\",\"\",Removals_Secondary!$K22)","v":""},{"$f":"IF($B25=\"\",\"\",IFERROR(INDEX('quantities report_secondary'!$D$2:$D$10003,SMALL(IF('quantities report_secondary'!$A$2:$A$10003=L$6,ROW('quantities report_secondary'!$A$2:$A$10003)-1,\"\"),ROWS($B$8:$B25))),\"0\"))","v":""},{"$f":"IF(B25=\"\",\"\",LOOKUP(B25,'manual inputs_secondary'!$B$4:$B$22,'manual inputs_secondary'!$D$4:$D$22))","v":""},"",{"$f":"IF($B25=\"\",\"\",IFERROR(INDEX('quantities report_secondary'!$D$2:$D$10003,SMALL(IF('quantities report_secondary'!$A$2:$A$10003=O$6,ROW('quantities report_secondary'!$A$2:$A$10003)-1,\"\"),ROWS($B$8:$B25))),\"0\"))","v":""},"",null,"",{"$f":"IF($B25=\"\",\"\",Backfill_Secondary!E25)","v":""},{"$f":"IF($B25=\"\",\"\",Backfill_Secondary!H25)","v":""},{"$f":"IF($B25=\"\",\"\",IFERROR(INDEX('quantities report_secondary'!$D$2:$D$10003,SMALL(IF('quantities report_secondary'!$A$2:$A$10003=U$6,ROW('quantities report_secondary'!$A$2:$A$10003)-1,\"\"),ROWS($B$8:$B25))),\"0\"))","v":""},{"$f":"IF($B25=\"\",\"\",IFERROR(INDEX('quantities report_secondary'!$D$2:$D$10003,SMALL(IF('quantities report_secondary'!$A$2:$A$10003=V$6,ROW('quantities report_secondary'!$A$2:$A$10003)-1,\"\"),ROWS($B$8:$B25))),\"0\"))","v":""},{"$f":"IF($B25=\"\",\"\",IFERROR(INDEX('quantities report_secondary'!$D$2:$D$10003,SMALL(IF('quantities report_secondary'!$A$2:$A$10003=W$6,ROW('quantities report_secondary'!$A$2:$A$10003)-1,\"\"),ROWS($B$8:$B25))),\"0\"))","v":""},{"$f":"IF($B25=\"\",\"\",IFERROR(INDEX('quantities report_secondary'!$D$2:$D$10003,SMALL(IF('quantities report_secondary'!$A$2:$A$10003=X$6,ROW('quantities report_secondary'!$A$2:$A$10003)-1,\"\"),ROWS($B$8:$B25))),\"0\"))","v":""},{"$f":"IF($B25=\"\",\"\",Backfill_Secondary!P25)","v":""},{"$f":"IF($B25=\"\",\"\",IFERROR(INDEX('quantities report_secondary'!$D$2:$D$10003,SMALL(IF('quantities report_secondary'!$A$2:$A$10003=Z$6,ROW('quantities report_secondary'!$A$2:$A$10003)-1,\"\"),ROWS($B$8:$B25))),\"0\"))","v":""},{"$f":"IF($B25=\"\",\"\",Removals_Secondary!$G22)","v":""},{"$f":"IF($B25=\"\",\"\",Removals_Secondary!$L22)","v":""},{"$f":"IF($B25=\"\",\"\",IFERROR(INDEX('quantities report_secondary'!$D$2:$D$10003,SMALL(IF('quantities report_secondary'!$A$2:$A$10003=AC$6,ROW('quantities report_secondary'!$A$2:$A$10003)-1,\"\"),ROWS($B$8:$B25))),\"0\"))","v":""},{"$f":"IF($B25=\"\",\"\",IFERROR(INDEX('quantities report_secondary'!$D$2:$D$10003,SMALL(IF('quantities report_secondary'!$A$2:$A$10003=AD$6,ROW('quantities report_secondary'!$A$2:$A$10003)-1,\"\"),ROWS($B$8:$B25))),\"0\"))","v":""},{"$f":"IF($B25=\"\",\"\",IFERROR(INDEX('quantities report_secondary'!$D$2:$D$10003,SMALL(IF('quantities report_secondary'!$A$2:$A$10003=AE$6,ROW('quantities report_secondary'!$A$2:$A$10003)-1,\"\"),ROWS($B$8:$B25))),\"0\"))","v":""},{"$f":"IF($B25=\"\",\"\",IFERROR(INDEX('quantities report_secondary'!$D$2:$D$10003,SMALL(IF('quantities report_secondary'!$A$2:$A$10003=AF$6,ROW('quantities report_secondary'!$A$2:$A$10003)-1,\"\"),ROWS($B$8:$B25))),\"0\"))","v":""},{"$f":"IF($B25=\"\",\"\",IFERROR(INDEX('quantities report_secondary'!$D$2:$D$10003,SMALL(IF('quantities report_secondary'!$A$2:$A$10003=AG$6,ROW('quantities report_secondary'!$A$2:$A$10003)-1,\"\"),ROWS($B$8:$B25))),\"0\"))","v":""},{"$f":"IF($B25=\"\",\"\",IFERROR(INDEX('quantities report_secondary'!$D$2:$D$10003,SMALL(IF('quantities report_secondary'!$A$2:$A$10003=AH$6,ROW('quantities report_secondary'!$A$2:$A$10003)-1,\"\"),ROWS($B$8:$B25))),\"0\"))","v":""},"","","","","",0.9,"",""]
[null,{"$f":"IFERROR(INDEX('manual inputs_secondary'!M:M,SMALL(IF('manual inputs_secondary'!M:M<>\"\",ROW('manual inputs_secondary'!M:M)),ROW(21:21))),\"\")","v":""},{"$f":"IF(B26=\"\",\"\",IFERROR(INDEX('quantities report_secondary'!$D$2:$D$10003,SMALL(IF('quantities report_secondary'!$A$2:$A$10003=C$6,ROW('quantities report_secondary'!$A$2:$A$10003)-1,\"\"),ROWS($B$8:$B26))),\"0\"))","v":""},"",null,"",{"$f":"IF($B26=\"\",\"\",Structure_Ex_Secondary!I26)","v":""},null,{"$f":"IF($B26=\"\",\"\",IFERROR(INDEX('quantities report_secondary'!$D$2:$D$10003,SMALL(IF('quantities report_secondary'!$A$2:$A$10003=I$6,ROW('quantities report_secondary'!$A$2:$A$10003)-1,\"\"),ROWS($B$8:$B26))),\"0\"))","v":""},{"$f":"IF($B26=\"\",\"\",[1]Removals_secondary!$F23)","v":""},{"$f":"IF($B26=\"\",\"\",Removals_Secondary!$K23)","v":""},{"$f":"IF($B26=\"\",\"\",IFERROR(INDEX('quantities report_secondary'!$D$2:$D$10003,SMALL(IF('quantities report_secondary'!$A$2:$A$10003=L$6,ROW('quantities report_secondary'!$A$2:$A$10003)-1,\"\"),ROWS($B$8:$B26))),\"0\"))","v":""},{"$f":"IF(B26=\"\",\"\",LOOKUP(B26,'manual inputs_secondary'!$B$4:$B$22,'manual inputs_secondary'!$D$4:$D$22))","v":""},"",{"$f":"IF($B26=\"\",\"\",IFERROR(INDEX('quantities report_secondary'!$D$2:$D$10003,SMALL(IF('quantities report_secondary'!$A$2:$A$10003=O$6,ROW('quantities report_secondary'!$A$2:$A$10003)-1,\"\"),ROWS($B$8:$B26))),\"0\"))","v":""},"",null,"",{"$f":"IF($B26=\"\",\"\",Backfill_Secondary!E26)","v":""},{"$f":"IF($B26=\"\",\"\",Backfill_Secondary!H26)","v":""},{"$f":"IF($B26=\"\",\"\",IFERROR(INDEX('quantities report_secondary'!$D$2:$D$10003,SMALL(IF('quantities report_secondary'!$A$2:$A$10003=U$6,ROW('quantities report_secondary'!$A$2:$A$10003)-1,\"\"),ROWS($B$8:$B26))),\"0\"))","v":""},{"$f":"IF($B26=\"\",\"\",IFERROR(INDEX('quantities report_secondary'!$D$2:$D$10003,SMALL(IF('quantities report_secondary'!$A$2:$A$10003=V$6,ROW('quantities report_secondary'!$A$2:$A$10003)-1,\"\"),ROWS($B$8:$B26))),\"0\"))","v":""},{"$f":"IF($B26=\"\",\"\",IFERROR(INDEX('quantities report_secondary'!$D$2:$D$10003,SMALL(IF('quantities report_secondary'!$A$2:$A$10003=W$6,ROW('quantities report_secondary'!$A$2:$A$10003)-1,\"\"),ROWS($B$8:$B26))),\"0\"))","v":""},{"$f":"IF($B26=\"\",\"\",IFERROR(INDEX('quantities report_secondary'!$D$2:$D$10003,SMALL(IF('quantities report_secondary'!$A$2:$A$10003=X$6,ROW('quantities report_secondary'!$A$2:$A$10003)-1,\"\"),ROWS($B$8:$B26))),\"0\"))","v":""},{"$f":"IF($B26=\"\",\"\",Backfill_Secondary!P26)","v":""},{"$f":"IF($B26=\"\",\"\",IFERROR(INDEX('quantities report_secondary'!$D$2:$D$10003,SMALL(IF('quantities report_secondary'!$A$2:$A$10003=Z$6,ROW('quantities report_secondary'!$A$2:$A$10003)-1,\"\"),ROWS($B$8:$B26))),\"0\"))","v":""},{"$f":"IF($B26=\"\",\"\",Removals_Secondary!$G23)","v":""},{"$f":"IF($B26=\"\",\"\",Removals_Secondary!$L23)","v":""},{"$f":"IF($B26=\"\",\"\",IFERROR(INDEX('quantities report_secondary'!$D$2:$D$10003,SMALL(IF('quantities report_secondary'!$A$2:$A$10003=AC$6,ROW('quantities report_secondary'!$A$2:$A$10003)-1,\"\"),ROWS($B$8:$B26))),\"0\"))","v":""},{"$f":"IF($B26=\"\",\"\",IFERROR(INDEX('quantities report_secondary'!$D$2:$D$10003,SMALL(IF('quantities report_secondary'!$A$2:$A$10003=AD$6,ROW('quantities report_secondary'!$A$2:$A$10003)-1,\"\"),ROWS($B$8:$B26))),\"0\"))","v":""},{"$f":"IF($B26=\"\",\"\",IFERROR(INDEX('quantities report_secondary'!$D$2:$D$10003,SMALL(IF('quantities report_secondary'!$A$2:$A$10003=AE$6,ROW('quantities report_secondary'!$A$2:$A$10003)-1,\"\"),ROWS($B$8:$B26))),\"0\"))","v":""},{"$f":"IF($B26=\"\",\"\",IFERROR(INDEX('quantities report_secondary'!$D$2:$D$10003,SMALL(IF('quantities report_secondary'!$A$2:$A$10003=AF$6,ROW('quantities report_secondary'!$A$2:$A$10003)-1,\"\"),ROWS($B$8:$B26))),\"0\"))","v":""},{"$f":"IF($B26=\"\",\"\",IFERROR(INDEX('quantities report_secondary'!$D$2:$D$10003,SMALL(IF('quantities report_secondary'!$A$2:$A$10003=AG$6,ROW('quantities report_secondary'!$A$2:$A$10003)-1,\"\"),ROWS($B$8:$B26))),\"0\"))","v":""},{"$f":"IF($B26=\"\",\"\",IFERROR(INDEX('quantities report_secondary'!$D$2:$D$10003,SMALL(IF('quantities report_secondary'!$A$2:$A$10003=AH$6,ROW('quantities report_secondary'!$A$2:$A$10003)-1,\"\"),ROWS($B$8:$B26))),\"0\"))","v":""},"","","","","",0.9,"",""]
[null,{"$f":"IFERROR(INDEX('manual inputs_secondary'!M:M,SMALL(IF('manual inputs_secondary'!M:M<>\"\",ROW('manual inputs_secondary'!M:M)),ROW(22:22))),\"\")","v":""},{"$f":"IF(B27=\"\",\"\",IFERROR(INDEX('quantities report_secondary'!$D$2:$D$10003,SMALL(IF('quantities report_secondary'!$A$2:$A$10003=C$6,ROW('quantities report_secondary'!$A$2:$A$10003)-1,\"\"),ROWS($B$8:$B27))),\"0\"))","v":""},"",null,"",{"$f":"IF($B27=\"\",\"\",Structure_Ex_Secondary!I27)","v":""},null,{"$f":"IF($B27=\"\",\"\",IFERROR(INDEX('quantities report_secondary'!$D$2:$D$10003,SMALL(IF('quantities report_secondary'!$A$2:$A$10003=I$6,ROW('quantities report_secondary'!$A$2:$A$10003)-1,\"\"),ROWS($B$8:$B27))),\"0\"))","v":""},{"$f":"IF($B27=\"\",\"\",[1]Removals_secondary!$F24)","v":""},{"$f":"IF($B27=\"\",\"\",Removals_Secondary!$K24)","v":""},{"$f":"IF($B27=\"\",\"\",IFERROR(INDEX('quantities report_secondary'!$D$2:$D$10003,SMALL(IF('quantities report_secondary'!$A$2:$A$10003=L$6,ROW('quantities report_secondary'!$A$2:$A$10003)-1,\"\"),ROWS($B$8:$B27))),\"0\"))","v":""},{"$f":"IF(B27=\"\",\"\",LOOKUP(B27,'manual inputs_secondary'!$B$4:$B$22,'manual inputs_secondary'!$D$4:$D$22))","v":""},"",{"$f":"IF($B27=\"\",\"\",IFERROR(INDEX('quantities report_secondary'!$D$2:$D$10003,SMALL(IF('quantities report_secondary'!$A$2:$A$10003=O$6,ROW('quantities report_secondary'!$A$2:$A$10003)-1,\"\"),ROWS($B$8:$B27))),\"0\"))","v":""},"",null,"",{"$f":"IF($B27=\"\",\"\",Backfill_Secondary!E27)","v":""},{"$f":"IF($B27=\"\",\"\",Backfill_Secondary!H27)","v":""},{"$f":"IF($B27=\"\",\"\",IFERROR(INDEX('quantities report_secondary'!$D$2:$D$10003,SMALL(IF('quantities report_secondary'!$A$2:$A$10003=U$6,ROW('quantities report_secondary'!$A$2:$A$10003)-1,\"\"),ROWS($B$8:$B27))),\"0\"))","v":""},{"$f":"IF($B27=\"\",\"\",IFERROR(INDEX('quantities report_secondary'!$D$2:$D$10003,SMALL(IF('quantities report_secondary'!$A$2:$A$10003=V$6,ROW('quantities report_secondary'!$A$2:$A$10003)-1,\"\"),ROWS($B$8:$B27))),\"0\"))","v":""},{"$f":"IF($B27=\"\",\"\",IFERROR(INDEX('quantities report_secondary'!$D$2:$D$10003,SMALL(IF('quantities report_secondary'!$A$2:$A$10003=W$6,ROW('quantities report_secondary'!$A$2:$A$10003)-1,\"\"),ROWS($B$8:$B27))),\"0\"))","v":""},{"$f":"IF($B27=\"\",\"\",IFERROR(INDEX('quantities report_secondary'!$D$2:$D$10003,SMALL(IF('quantities report_secondary'!$A$2:$A$10003=X$6,ROW('quantities report_secondary'!$A$2:$A$10003)-1,\"\"),ROWS($B$8:$B27))),\"0\"))","v":""},{"$f":"IF($B27=\"\",\"\",Backfill_Secondary!P27)","v":""},{"$f":"IF($B27=\"\",\"\",IFERROR(INDEX('quantities report_secondary'!$D$2:$D$10003,SMALL(IF('quantities report_secondary'!$A$2:$A$10003=Z$6,ROW('quantities report_secondary'!$A$2:$A$10003)-1,\"\"),ROWS($B$8:$B27))),\"0\"))","v":""},{"$f":"IF($B27=\"\",\"\",Removals_Secondary!$G24)","v":""},{"$f":"IF($B27=\"\",\"\",Removals_Secondary!$L24)","v":""},{"$f":"IF($B27=\"\",\"\",IFERROR(INDEX('quantities report_secondary'!$D$2:$D$10003,SMALL(IF('quantities report_secondary'!$A$2:$A$10003=AC$6,ROW('quantities report_secondary'!$A$2:$A$10003)-1,\"\"),ROWS($B$8:$B27))),\"0\"))","v":""},{"$f":"IF($B27=\"\",\"\",IFERROR(INDEX('quantities report_secondary'!$D$2:$D$10003,SMALL(IF('quantities report_secondary'!$A$2:$A$10003=AD$6,ROW('quantities report_secondary'!$A$2:$A$10003)-1,\"\"),ROWS($B$8:$B27))),\"0\"))","v":""},{"$f":"IF($B27=\"\",\"\",IFERROR(INDEX('quantities report_secondary'!$D$2:$D$10003,SMALL(IF('quantities report_secondary'!$A$2:$A$10003=AE$6,ROW('quantities report_secondary'!$A$2:$A$10003)-1,\"\"),ROWS($B$8:$B27))),\"0\"))","v":""},{"$f":"IF($B27=\"\",\"\",IFERROR(INDEX('quantities report_secondary'!$D$2:$D$10003,SMALL(IF('quantities report_secondary'!$A$2:$A$10003=AF$6,ROW('quantities report_secondary'!$A$2:$A$10003)-1,\"\"),ROWS($B$8:$B27))),\"0\"))","v":""},{"$f":"IF($B27=\"\",\"\",IFERROR(INDEX('quantities report_secondary'!$D$2:$D$10003,SMALL(IF('quantities report_secondary'!$A$2:$A$10003=AG$6,ROW('quantities report_secondary'!$A$2:$A$10003)-1,\"\"),ROWS($B$8:$B27))),\"0\"))","v":""},{"$f":"IF($B27=\"\",\"\",IFERROR(INDEX('quantities report_secondary'!$D$2:$D$10003,SMALL(IF('quantities report_secondary'!$A$2:$A$10003=AH$6,ROW('quantities report_secondary'!$A$2:$A$10003)-1,\"\"),ROWS($B$8:$B27))),\"0\"))","v":""},"","","","","",0.9,"",""]
[null,{"$f":"IFERROR(INDEX('manual inputs_secondary'!M:M,SMALL(IF('manual inputs_secondary'!M:M<>\"\",ROW('manual inputs_secondary'!M:M)),ROW(23:23))),\"\")","v":""},{"$f":"IF(B28=\"\",\"\",IFERROR(INDEX('quantities report_secondary'!$D$2:$D$10003,SMALL(IF('quantities report_secondary'!$A$2:$A$10003=C$6,ROW('quantities report_secondary'!$A$2:$A$10003)-1,\"\"),ROWS($B$8:$B28))),\"0\"))","v":""},"",null,"",{"$f":"IF($B28=\"\",\"\",Structure_Ex_Secondary!I28)","v":""},null,{"$f":"IF($B28=\"\",\"\",IFERROR(INDEX('quantities report_secondary'!$D$2:$D$10003,SMALL(IF('quantities report_secondary'!$A$2:$A$10003=I$6,ROW('quantities report_secondary'!$A$2:$A$10003)-1,\"\"),ROWS($B$8:$B28))),\"0\"))","v":""},{"$f":"IF($B28=\"\",\"\",[1]Removals_secondary!$F25)","v":""},{"$f":"IF($B28=\"\",\"\",Removals_Secondary!$K25)","v":""},{"$f":"IF($B28=\"\",\"\",IFERROR(INDEX('quantities report_secondary'!$D$2:$D$10003,SMALL(IF('quantities report_secondary'!$A$2:$A$10003=L$6,ROW('quantities report_secondary'!$A$2:$A$10003)-1,\"\"),ROWS($B$8:$B28))),\"0\"))","v":""},{"$f":"IF(B28=\"\",\"\",LOOKUP(B28,'manual inputs_secondary'!$B$4:$B$22,'manual inputs_secondary'!$D$4:$D$22))","v":""},"",{"$f":"IF($B28=\"\",\"\",IFERROR(INDEX('quantities report_secondary'!$D$2:$D$10003,SMALL(IF('quantities report_secondary'!$A$2:$A$10003=O$6,ROW('quantities report_secondary'!$A$2:$A$10003)-1,\"\"),ROWS($B$8:$B28))),\"0\"))","v":""},"",null,"",{"$f":"IF($B28=\"\",\"\",Backfill_Secondary!E28)","v":""},{"$f":"IF($B28=\"\",\"\",Backfill_Secondary!H28)","v":""},{"$f":"IF($B28=\"\",\"\",IFERROR(INDEX('quantities report_secondary'!$D$2:$D$10003,SMALL(IF('quantities report_secondary'!$A$2:$A$10003=U$6,ROW('quantities report_secondary'!$A$2:$A$10003)-1,\"\"),ROWS($B$8:$B28))),\"0\"))","v":""},{"$f":"IF($B28=\"\",\"\",IFERROR(INDEX('quantities report_secondary'!$D$2:$D$10003,SMALL(IF('quantities report_secondary'!$A$2:$A$10003=V$6,ROW('quantities report_secondary'!$A$2:$A$10003)-1,\"\"),ROWS($B$8:$B28))),\"0\"))","v":""},{"$f":"IF($B28=\"\",\"\",IFERROR(INDEX('quantities report_secondary'!$D$2:$D$10003,SMALL(IF('quantities report_secondary'!$A$2:$A$10003=W$6,ROW('quantities report_secondary'!$A$2:$A$10003)-1,\"\"),ROWS($B$8:$B28))),\"0\"))","v":""},{"$f":"IF($B28=\"\",\"\",IFERROR(INDEX('quantities report_secondary'!$D$2:$D$10003,SMALL(IF('quantities report_secondary'!$A$2:$A$10003=X$6,ROW('quantities report_secondary'!$A$2:$A$10003)-1,\"\"),ROWS($B$8:$B28))),\"0\"))","v":""},{"$f":"IF($B28=\"\",\"\",Backfill_Secondary!P28)","v":""},{"$f":"IF($B28=\"\",\"\",IFERROR(INDEX('quantities report_secondary'!$D$2:$D$10003,SMALL(IF('quantities report_secondary'!$A$2:$A$10003=Z$6,ROW('quantities report_secondary'!$A$2:$A$10003)-1,\"\"),ROWS($B$8:$B28))),\"0\"))","v":""},{"$f":"IF($B28=\"\",\"\",Removals_Secondary!$G25)","v":""},{"$f":"IF($B28=\"\",\"\",Removals_Secondary!$L25)","v":""},{"$f":"IF($B28=\"\",\"\",IFERROR(INDEX('quantities report_secondary'!$D$2:$D$10003,SMALL(IF('quantities report_secondary'!$A$2:$A$10003=AC$6,ROW('quantities report_secondary'!$A$2:$A$10003)-1,\"\"),ROWS($B$8:$B28))),\"0\"))","v":""},{"$f":"IF($B28=\"\",\"\",IFERROR(INDEX('quantities report_secondary'!$D$2:$D$10003,SMALL(IF('quantities report_secondary'!$A$2:$A$10003=AD$6,ROW('quantities report_secondary'!$A$2:$A$10003)-1,\"\"),ROWS($B$8:$B28))),\"0\"))","v":""},{"$f":"IF($B28=\"\",\"\",IFERROR(INDEX('quantities report_secondary'!$D$2:$D$10003,SMALL(IF('quantities report_secondary'!$A$2:$A$10003=AE$6,ROW('quantities report_secondary'!$A$2:$A$10003)-1,\"\"),ROWS($B$8:$B28))),\"0\"))","v":""},{"$f":"IF($B28=\"\",\"\",IFERROR(INDEX('quantities report_secondary'!$D$2:$D$10003,SMALL(IF('quantities report_secondary'!$A$2:$A$10003=AF$6,ROW('quantities report_secondary'!$A$2:$A$10003)-1,\"\"),ROWS($B$8:$B28))),\"0\"))","v":""},{"$f":"IF($B28=\"\",\"\",IFERROR(INDEX('quantities report_secondary'!$D$2:$D$10003,SMALL(IF('quantities report_secondary'!$A$2:$A$10003=AG$6,ROW('quantities report_secondary'!$A$2:$A$10003)-1,\"\"),ROWS($B$8:$B28))),\"0\"))","v":""},{"$f":"IF($B28=\"\",\"\",IFERROR(INDEX('quantities report_secondary'!$D$2:$D$10003,SMALL(IF('quantities report_secondary'!$A$2:$A$10003=AH$6,ROW('quantities report_secondary'!$A$2:$A$10003)-1,\"\"),ROWS($B$8:$B28))),\"0\"))","v":""},"","","","","",0.9,"",""]
[null,{"$f":"IFERROR(INDEX('manual inputs_secondary'!M:M,SMALL(IF('manual inputs_secondary'!M:M<>\"\",ROW('manual inputs_secondary'!M:M)),ROW(24:24))),\"\")","v":""},{"$f":"IF(B29=\"\",\"\",IFERROR(INDEX('quantities report_secondary'!$D$2:$D$10003,SMALL(IF('quantities report_secondary'!$A$2:$A$10003=C$6,ROW('quantities report_secondary'!$A$2:$A$10003)-1,\"\"),ROWS($B$8:$B29))),\"0\"))","v":""},"",null,"",{"$f":"IF($B29=\"\",\"\",Structure_Ex_Secondary!I29)","v":""},null,{"$f":"IF($B29=\"\",\"\",IFERROR(INDEX('quantities report_secondary'!$D$2:$D$10003,SMALL(IF('quantities report_secondary'!$A$2:$A$10003=I$6,ROW('quantities report_secondary'!$A$2:$A$10003)-1,\"\"),ROWS($B$8:$B29))),\"0\"))","v":""},{"$f":"IF($B29=\"\",\"\",[1]Removals_secondary!$F26)","v":""},{"$f":"IF($B29=\"\",\"\",Removals_Secondary!$K26)","v":""},{"$f":"IF($B29=\"\",\"\",IFERROR(INDEX('quantities report_secondary'!$D$2:$D$10003,SMALL(IF('quantities report_secondary'!$A$2:$A$10003=L$6,ROW('quantities report_secondary'!$A$2:$A$10003)-1,\"\"),ROWS($B$8:$B29))),\"0\"))","v":""},{"$f":"IF(B29=\"\",\"\",LOOKUP(B29,'manual inputs_secondary'!$B$4:$B$22,'manual inputs_secondary'!$D$4:$D$22))","v":""},"",{"$f":"IF($B29=\"\",\"\",IFERROR(INDEX('quantities report_secondary'!$D$2:$D$10003,SMALL(IF('quantities report_secondary'!$A$2:$A$10003=O$6,ROW('quantities report_secondary'!$A$2:$A$10003)-1,\"\"),ROWS($B$8:$B29))),\"0\"))","v":""},"",null,"",{"$f":"IF($B29=\"\",\"\",Backfill_Secondary!E29)","v":""},{"$f":"IF($B29=\"\",\"\",Backfill_Secondary!H29)","v":""},{"$f":"IF($B29=\"\",\"\",IFERROR(INDEX('quantities report_secondary'!$D$2:$D$10003,SMALL(IF('quantities report_secondary'!$A$2:$A$10003=U$6,ROW('quantities report_secondary'!$A$2:$A$10003)-1,\"\"),ROWS($B$8:$B29))),\"0\"))","v":""},{"$f":"IF($B29=\"\",\"\",IFERROR(INDEX('quantities report_secondary'!$D$2:$D$10003,SMALL(IF('quantities report_secondary'!$A$2:$A$10003=V$6,ROW('quantities report_secondary'!$A$2:$A$10003)-1,\"\"),ROWS($B$8:$B29))),\"0\"))","v":""},{"$f":"IF($B29=\"\",\"\",IFERROR(INDEX('quantities report_secondary'!$D$2:$D$10003,SMALL(IF('quantities report_secondary'!$A$2:$A$10003=W$6,ROW('quantities report_secondary'!$A$2:$A$10003)-1,\"\"),ROWS($B$8:$B29))),\"0\"))","v":""},{"$f":"IF($B29=\"\",\"\",IFERROR(INDEX('quantities report_secondary'!$D$2:$D$10003,SMALL(IF('quantities report_secondary'!$A$2:$A$10003=X$6,ROW('quantities report_secondary'!$A$2:$A$10003)-1,\"\"),ROWS($B$8:$B29))),\"0\"))","v":""},{"$f":"IF($B29=\"\",\"\",Backfill_Secondary!P29)","v":""},{"$f":"IF($B29=\"\",\"\",IFERROR(INDEX('quantities report_secondary'!$D$2:$D$10003,SMALL(IF('quantities report_secondary'!$A$2:$A$10003=Z$6,ROW('quantities report_secondary'!$A$2:$A$10003)-1,\"\"),ROWS($B$8:$B29))),\"0\"))","v":""},{"$f":"IF($B29=\"\",\"\",Removals_Secondary!$G26)","v":""},{"$f":"IF($B29=\"\",\"\",Removals_Secondary!$L26)","v":""},{"$f":"IF($B29=\"\",\"\",IFERROR(INDEX('quantities report_secondary'!$D$2:$D$10003,SMALL(IF('quantities report_secondary'!$A$2:$A$10003=AC$6,ROW('quantities report_secondary'!$A$2:$A$10003)-1,\"\"),ROWS($B$8:$B29))),\"0\"))","v":""},{"$f":"IF($B29=\"\",\"\",IFERROR(INDEX('quantities report_secondary'!$D$2:$D$10003,SMALL(IF('quantities report_secondary'!$A$2:$A$10003=AD$6,ROW('quantities report_secondary'!$A$2:$A$10003)-1,\"\"),ROWS($B$8:$B29))),\"0\"))","v":""},{"$f":"IF($B29=\"\",\"\",IFERROR(INDEX('quantities report_secondary'!$D$2:$D$10003,SMALL(IF('quantities report_secondary'!$A$2:$A$10003=AE$6,ROW('quantities report_secondary'!$A$2:$A$10003)-1,\"\"),ROWS($B$8:$B29))),\"0\"))","v":""},{"$f":"IF($B29=\"\",\"\",IFERROR(INDEX('quantities report_secondary'!$D$2:$D$10003,SMALL(IF('quantities report_secondary'!$A$2:$A$10003=AF$6,ROW('quantities report_secondary'!$A$2:$A$10003)-1,\"\"),ROWS($B$8:$B29))),\"0\"))","v":""},{"$f":"IF($B29=\"\",\"\",IFERROR(INDEX('quantities report_secondary'!$D$2:$D$10003,SMALL(IF('quantities report_secondary'!$A$2:$A$10003=AG$6,ROW('quantities report_secondary'!$A$2:$A$10003)-1,\"\"),ROWS($B$8:$B29))),\"0\"))","v":""},{"$f":"IF($B29=\"\",\"\",IFERROR(INDEX('quantities report_secondary'!$D$2:$D$10003,SMALL(IF('quantities report_secondary'!$A$2:$A$10003=AH$6,ROW('quantities report_secondary'!$A$2:$A$10003)-1,\"\"),ROWS($B$8:$B29))),\"0\"))","v":""},"","","","","",0.9,"",""]
[null,{"$f":"IFERROR(INDEX('manual inputs_secondary'!M:M,SMALL(IF('manual inputs_secondary'!M:M<>\"\",ROW('manual inputs_secondary'!M:M)),ROW(25:25))),\"\")","v":""},{"$f":"IF(B30=\"\",\"\",IFERROR(INDEX('quantities report_secondary'!$D$2:$D$10003,SMALL(IF('quantities report_secondary'!$A$2:$A$10003=C$6,ROW('quantities report_secondary'!$A$2:$A$10003)-1,\"\"),ROWS($B$8:$B30))),\"0\"))","v":""},"",null,"",{"$f":"IF($B30=\"\",\"\",Structure_Ex_Secondary!I30)","v":""},null,{"$f":"IF($B30=\"\",\"\",IFERROR(INDEX('quantities report_secondary'!$D$2:$D$10003,SMALL(IF('quantities report_secondary'!$A$2:$A$10003=I$6,ROW('quantities report_secondary'!$A$2:$A$10003)-1,\"\"),ROWS($B$8:$B30))),\"0\"))","v":""},{"$f":"IF($B30=\"\",\"\",[1]Removals_secondary!$F27)","v":""},{"$f":"IF($B30=\"\",\"\",Removals_Secondary!$K27)","v":""},{"$f":"IF($B30=\"\",\"\",IFERROR(INDEX('quantities report_secondary'!$D$2:$D$10003,SMALL(IF('quantities report_secondary'!$A$2:$A$10003=L$6,ROW('quantities report_secondary'!$A$2:$A$10003)-1,\"\"),ROWS($B$8:$B30))),\"0\"))","v":""},{"$f":"IF(B30=\"\",\"\",LOOKUP(B30,'manual inputs_secondary'!$B$4:$B$22,'manual inputs_secondary'!$D$4:$D$22))","v":""},"",{"$f":"IF($B30=\"\",\"\",IFERROR(INDEX('quantities report_secondary'!$D$2:$D$10003,SMALL(IF('quantities report_secondary'!$A$2:$A$10003=O$6,ROW('quantities report_secondary'!$A$2:$A$10003)-1,\"\"),ROWS($B$8:$B30))),\"0\"))","v":""},"",null,"",{"$f":"IF($B30=\"\",\"\",Backfill_Secondary!E30)","v":""},{"$f":"IF($B30=\"\",\"\",Backfill_Secondary!H30)","v":""},{"$f":"IF($B30=\"\",\"\",IFERROR(INDEX('quantities report_secondary'!$D$2:$D$10003,SMALL(IF('quantities report_secondary'!$A$2:$A$10003=U$6,ROW('quantities report_secondary'!$A$2:$A$10003)-1,\"\"),ROWS($B$8:$B30))),\"0\"))","v":""},{"$f":"IF($B30=\"\",\"\",IFERROR(INDEX('quantities report_secondary'!$D$2:$D$10003,SMALL(IF('quantities report_secondary'!$A$2:$A$10003=V$6,ROW('quantities report_secondary'!$A$2:$A$10003)-1,\"\"),ROWS($B$8:$B30))),\"0\"))","v":""},{"$f":"IF($B30=\"\",\"\",IFERROR(INDEX('quantities report_secondary'!$D$2:$D$10003,SMALL(IF('quantities report_secondary'!$A$2:$A$10003=W$6,ROW('quantities report_secondary'!$A$2:$A$10003)-1,\"\"),ROWS($B$8:$B30))),\"0\"))","v":""},{"$f":"IF($B30=\"\",\"\",IFERROR(INDEX('quantities report_secondary'!$D$2:$D$10003,SMALL(IF('quantities report_secondary'!$A$2:$A$10003=X$6,ROW('quantities report_secondary'!$A$2:$A$10003)-1,\"\"),ROWS($B$8:$B30))),\"0\"))","v":""},{"$f":"IF($B30=\"\",\"\",Backfill_Secondary!P30)","v":""},{"$f":"IF($B30=\"\",\"\",IFERROR(INDEX('quantities report_secondary'!$D$2:$D$10003,SMALL(IF('quantities report_secondary'!$A$2:$A$10003=Z$6,ROW('quantities report_secondary'!$A$2:$A$10003)-1,\"\"),ROWS($B$8:$B30))),\"0\"))","v":""},{"$f":"IF($B30=\"\",\"\",Removals_Secondary!$G27)","v":""},{"$f":"IF($B30=\"\",\"\",Removals_Secondary!$L27)","v":""},{"$f":"IF($B30=\"\",\"\",IFERROR(INDEX('quantities report_secondary'!$D$2:$D$10003,SMALL(IF('quantities report_secondary'!$A$2:$A$10003=AC$6,ROW('quantities report_secondary'!$A$2:$A$10003)-1,\"\"),ROWS($B$8:$B30))),\"0\"))","v":""},{"$f":"IF($B30=\"\",\"\",IFERROR(INDEX('quantities report_secondary'!$D$2:$D$10003,SMALL(IF('quantities report_secondary'!$A$2:$A$10003=AD$6,ROW('quantities report_secondary'!$A$2:$A$10003)-1,\"\"),ROWS($B$8:$B30))),\"0\"))","v":""},{"$f":"IF($B30=\"\",\"\",IFERROR(INDEX('quantities report_secondary'!$D$2:$D$10003,SMALL(IF('quantities report_secondary'!$A$2:$A$10003=AE$6,ROW('quantities report_secondary'!$A$2:$A$10003)-1,\"\"),ROWS($B$8:$B30))),\"0\"))","v":""},{"$f":"IF($B30=\"\",\"\",IFERROR(INDEX('quantities report_secondary'!$D$2:$D$10003,SMALL(IF('quantities report_secondary'!$A$2:$A$10003=AF$6,ROW('quantities report_secondary'!$A$2:$A$10003)-1,\"\"),ROWS($B$8:$B30))),\"0\"))","v":""},{"$f":"IF($B30=\"\",\"\",IFERROR(INDEX('quantities report_secondary'!$D$2:$D$10003,SMALL(IF('quantities report_secondary'!$A$2:$A$10003=AG$6,ROW('quantities report_secondary'!$A$2:$A$10003)-1,\"\"),ROWS($B$8:$B30))),\"0\"))","v":""},{"$f":"IF($B30=\"\",\"\",IFERROR(INDEX('quantities report_secondary'!$D$2:$D$10003,SMALL(IF('quantities report_secondary'!$A$2:$A$10003=AH$6,ROW('quantities report_secondary'!$A$2:$A$10003)-1,\"\"),ROWS($B$8:$B30))),\"0\"))","v":""},"","","","","",0.9,"",""]
[null,{"$f":"IFERROR(INDEX('manual inputs_secondary'!M:M,SMALL(IF('manual inputs_secondary'!M:M<>\"\",ROW('manual inputs_secondary'!M:M)),ROW(26:26))),\"\")","v":""},{"$f":"IF(B31=\"\",\"\",IFERROR(INDEX('quantities report_secondary'!$D$2:$D$10003,SMALL(IF('quantities report_secondary'!$A$2:$A$10003=C$6,ROW('quantities report_secondary'!$A$2:$A$10003)-1,\"\"),ROWS($B$8:$B31))),\"0\"))","v":""},"",null,"",{"$f":"IF($B31=\"\",\"\",Structure_Ex_Secondary!I31)","v":""},null,{"$f":"IF($B31=\"\",\"\",IFERROR(INDEX('quantities report_secondary'!$D$2:$D$10003,SMALL(IF('quantities report_secondary'!$A$2:$A$10003=I$6,ROW('quantities report_secondary'!$A$2:$A$10003)-1,\"\"),ROWS($B$8:$B31))),\"0\"))","v":""},{"$f":"IF($B31=\"\",\"\",[1]Removals_secondary!$F28)","v":""},{"$f":"IF($B31=\"\",\"\",Removals_Secondary!$K28)","v":""},{"$f":"IF($B31=\"\",\"\",IFERROR(INDEX('quantities report_secondary'!$D$2:$D$10003,SMALL(IF('quantities report_secondary'!$A$2:$A$10003=L$6,ROW('quantities report_secondary'!$A$2:$A$10003)-1,\"\"),ROWS($B$8:$B31))),\"0\"))","v":""},{"$f":"IF(B31=\"\",\"\",LOOKUP(B31,'manual inputs_secondary'!$B$4:$B$22,'manual inputs_secondary'!$D$4:$D$22))","v":""},"",{"$f":"IF($B31=\"\",\"\",IFERROR(INDEX('quantities report_secondary'!$D$2:$D$10003,SMALL(IF('quantities report_secondary'!$A$2:$A$10003=O$6,ROW('quantities report_secondary'!$A$2:$A$10003)-1,\"\"),ROWS($B$8:$B31))),\"0\"))","v":""},"",null,"",{"$f":"IF($B31=\"\",\"\",Backfill_Secondary!E31)","v":""},{"$f":"IF($B31=\"\",\"\",Backfill_Secondary!H31)","v":""},{"$f":"IF($B31=\"\",\"\",IFERROR(INDEX('quantities report_secondary'!$D$2:$D$10003,SMALL(IF('quantities report_secondary'!$A$2:$A$10003=U$6,ROW('quantities report_secondary'!$A$2:$A$10003)-1,\"\"),ROWS($B$8:$B31))),\"0\"))","v":""},{"$f":"IF($B31=\"\",\"\",IFERROR(INDEX('quantities report_secondary'!$D$2:$D$10003,SMALL(IF('quantities report_secondary'!$A$2:$A$10003=V$6,ROW('quantities report_secondary'!$A$2:$A$10003)-1,\"\"),ROWS($B$8:$B31))),\"0\"))","v":""},{"$f":"IF($B31=\"\",\"\",IFERROR(INDEX('quantities report_secondary'!$D$2:$D$10003,SMALL(IF('quantities report_secondary'!$A$2:$A$10003=W$6,ROW('quantities report_secondary'!$A$2:$A$10003)-1,\"\"),ROWS($B$8:$B31))),\"0\"))","v":""},{"$f":"IF($B31=\"\",\"\",IFERROR(INDEX('quantities report_secondary'!$D$2:$D$10003,SMALL(IF('quantities report_secondary'!$A$2:$A$10003=X$6,ROW('quantities report_secondary'!$A$2:$A$10003)-1,\"\"),ROWS($B$8:$B31))),\"0\"))","v":""},{"$f":"IF($B31=\"\",\"\",Backfill_Secondary!P31)","v":""},{"$f":"IF($B31=\"\",\"\",IFERROR(INDEX('quantities report_secondary'!$D$2:$D$10003,SMALL(IF('quantities report_secondary'!$A$2:$A$10003=Z$6,ROW('quantities report_secondary'!$A$2:$A$10003)-1,\"\"),ROWS($B$8:$B31))),\"0\"))","v":""},{"$f":"IF($B31=\"\",\"\",Removals_Secondary!$G28)","v":""},{"$f":"IF($B31=\"\",\"\",Removals_Secondary!$L28)","v":""},{"$f":"IF($B31=\"\",\"\",IFERROR(INDEX('quantities report_secondary'!$D$2:$D$10003,SMALL(IF('quantities report_secondary'!$A$2:$A$10003=AC$6,ROW('quantities report_secondary'!$A$2:$A$10003)-1,\"\"),ROWS($B$8:$B31))),\"0\"))","v":""},{"$f":"IF($B31=\"\",\"\",IFERROR(INDEX('quantities report_secondary'!$D$2:$D$10003,SMALL(IF('quantities report_secondary'!$A$2:$A$10003=AD$6,ROW('quantities report_secondary'!$A$2:$A$10003)-1,\"\"),ROWS($B$8:$B31))),\"0\"))","v":""},{"$f":"IF($B31=\"\",\"\",IFERROR(INDEX('quantities report_secondary'!$D$2:$D$10003,SMALL(IF('quantities report_secondary'!$A$2:$A$10003=AE$6,ROW('quantities report_secondary'!$A$2:$A$10003)-1,\"\"),ROWS($B$8:$B31))),\"0\"))","v":""},{"$f":"IF($B31=\"\",\"\",IFERROR(INDEX('quantities report_secondary'!$D$2:$D$10003,SMALL(IF('quantities report_secondary'!$A$2:$A$10003=AF$6,ROW('quantities report_secondary'!$A$2:$A$10003)-1,\"\"),ROWS($B$8:$B31))),\"0\"))","v":""},{"$f":"IF($B31=\"\",\"\",IFERROR(INDEX('quantities report_secondary'!$D$2:$D$10003,SMALL(IF('quantities report_secondary'!$A$2:$A$10003=AG$6,ROW('quantities report_secondary'!$A$2:$A$10003)-1,\"\"),ROWS($B$8:$B31))),\"0\"))","v":""},{"$f":"IF($B31=\"\",\"\",IFERROR(INDEX('quantities report_secondary'!$D$2:$D$10003,SMALL(IF('quantities report_secondary'!$A$2:$A$10003=AH$6,ROW('quantities report_secondary'!$A$2:$A$10003)-1,\"\"),ROWS($B$8:$B31))),\"0\"))","v":""},"","","","","",0.9,"",""]
[null,{"$f":"IFERROR(INDEX(#REF!,SMALL(IF(#REF!<>\"\",ROW(#REF!)),ROW(27:27))),\"\")","v":""},{"$f":"IF(B32=\"\",\"\",IFERROR(INDEX('quantities report_secondary'!$D$2:$D$10003,SMALL(IF('quantities report_secondary'!$A$2:$A$10003=C$6,ROW('quantities report_secondary'!$A$2:$A$10003)-1,\"\"),ROWS($B$8:$B32))),\"0\"))","v":""},"",null,null,{"$f":"IF($B32=\"\",\"\",Structure_Ex_Secondary!I32)","v":""},null,{"$f":"IF($B32=\"\",\"\",IFERROR(INDEX('quantities report_secondary'!$D$2:$D$10003,SMALL(IF('quantities report_secondary'!$A$2:$A$10003=I$6,ROW('quantities report_secondary'!$A$2:$A$10003)-1,\"\"),ROWS($B$8:$B32))),\"0\"))","v":""},{"$f":"IF($B32=\"\",\"\",IFERROR(INDEX('quantities report_secondary'!$D$2:$D$10003,SMALL(IF('quantities report_secondary'!$A$2:$A$10003=J$6,ROW('quantities report_secondary'!$A$2:$A$10003)-1,\"\"),ROWS($B$8:$B32))),\"0\"))","v":""},{"$f":"IF($B32=\"\",\"\",IFERROR(INDEX('quantities report_secondary'!$D$2:$D$10003,SMALL(IF('quantities report_secondary'!$A$2:$A$10003=K$6,ROW('quantities report_secondary'!$A$2:$A$10003)-1,\"\"),ROWS($B$8:$B32))),\"0\"))","v":""},{"$f":"IF($B32=\"\",\"\",IFERROR(INDEX('quantities report_secondary'!$D$2:$D$10003,SMALL(IF('quantities report_secondary'!$A$2:$A$10003=L$6,ROW('quantities report_secondary'!$A$2:$A$10003)-1,\"\"),ROWS($B$8:$B32))),\"0\"))","v":""},{"$f":"IF(B32=\"\",\"\",LOOKUP(B32,'manual inputs_secondary'!$B$4:$B$22,'manual inputs_secondary'!$D$4:$D$22))","v":""},"",{"$f":"IF($B32=\"\",\"\",IFERROR(INDEX('quantities report_secondary'!$D$2:$D$10003,SMALL(IF('quantities report_secondary'!$A$2:$A$10003=O$6,ROW('quantities report_secondary'!$A$2:$A$10003)-1,\"\"),ROWS($B$8:$B32))),\"0\"))","v":""},"",null,null,{"$f":"IF($B32=\"\",\"\",Backfill_Secondary!E32)","v":""},{"$f":"IF($B32=\"\",\"\",Backfill_Secondary!H32)","v":""},{"$f":"IF($B32=\"\",\"\",IFERROR(INDEX('quantities report_secondary'!$D$2:$D$10003,SMALL(IF('quantities report_secondary'!$A$2:$A$10003=U$6,ROW('quantities report_secondary'!$A$2:$A$10003)-1,\"\"),ROWS($B$8:$B32))),\"0\"))","v":""},{"$f":"IF($B32=\"\",\"\",IFERROR(INDEX('quantities report_secondary'!$D$2:$D$10003,SMALL(IF('quantities report_secondary'!$A$2:$A$10003=V$6,ROW('quantities report_secondary'!$A$2:$A$10003)-1,\"\"),ROWS($B$8:$B32))),\"0\"))","v":""},{"$f":"IF($B32=\"\",\"\",IFERROR(INDEX('quantities report_secondary'!$D$2:$D$10003,SMALL(IF('quantities report_secondary'!$A$2:$A$10003=W$6,ROW('quantities report_secondary'!$A$2:$A$10003)-1,\"\"),ROWS($B$8:$B32))),\"0\"))","v":""},{"$f":"IF($B32=\"\",\"\",IFERROR(INDEX('quantities report_secondary'!$D$2:$D$10003,SMALL(IF('quantities report_secondary'!$A$2:$A$10003=X$6,ROW('quantities report_secondary'!$A$2:$A$10003)-1,\"\"),ROWS($B$8:$B32))),\"0\"))","v":""},{"$f":"IF($B32=\"\",\"\",Backfill_Secondary!P32)","v":""},{"$f":"IF($B32=\"\",\"\",IFERROR(INDEX('quantities report_secondary'!$D$2:$D$10003,SMALL(IF('quantities report_secondary'!$A$2:$A$10003=Z$6,ROW('quantities report_secondary'!$A$2:$A$10003)-1,\"\"),ROWS($B$8:$B32))),\"0\"))","v":""},{"$f":"IF($B32=\"\",\"\",IFERROR(INDEX('quantities report_secondary'!$D$2:$D$10003,SMALL(IF('quantities report_secondary'!$A$2:$A$10003=AA$6,ROW('quantities report_secondary'!$A$2:$A$10003)-1,\"\"),ROWS($B$8:$B32))),\"0\"))","v":""},{"$f":"IF($B32=\"\",\"\",IFERROR(INDEX('quantities report_secondary'!$D$2:$D$10003,SMALL(IF('quantities report_secondary'!$A$2:$A$10003=AB$6,ROW('quantities report_secondary'!$A$2:$A$10003)-1,\"\"),ROWS($B$8:$B32))),\"0\"))","v":""},{"$f":"IF($B32=\"\",\"\",IFERROR(INDEX('quantities report_secondary'!$D$2:$D$10003,SMALL(IF('quantities report_secondary'!$A$2:$A$10003=AC$6,ROW('quantities report_secondary'!$A$2:$A$10003)-1,\"\"),ROWS($B$8:$B32))),\"0\"))","v":""},{"$f":"IF($B32=\"\",\"\",IFERROR(INDEX('quantities report_secondary'!$D$2:$D$10003,SMALL(IF('quantities report_secondary'!$A$2:$A$10003=AD$6,ROW('quantities report_secondary'!$A$2:$A$10003)-1,\"\"),ROWS($B$8:$B32))),\"0\"))","v":""},{"$f":"IF($B32=\"\",\"\",IFERROR(INDEX('quantities report_secondary'!$D$2:$D$10003,SMALL(IF('quantities report_secondary'!$A$2:$A$10003=AE$6,ROW('quantities report_secondary'!$A$2:$A$10003)-1,\"\"),ROWS($B$8:$B32))),\"0\"))","v":""},{"$f":"IF($B32=\"\",\"\",IFERROR(INDEX('quantities report_secondary'!$D$2:$D$10003,SMALL(IF('quantities report_secondary'!$A$2:$A$10003=AF$6,ROW('quantities report_secondary'!$A$2:$A$10003)-1,\"\"),ROWS($B$8:$B32))),\"0\"))","v":""},{"$f":"IF($B32=\"\",\"\",IFERROR(INDEX('quantities report_secondary'!$D$2:$D$10003,SMALL(IF('quantities report_secondary'!$A$2:$A$10003=AG$6,ROW('quantities report_secondary'!$A$2:$A$10003)-1,\"\"),ROWS($B$8:$B32))),\"0\"))","v":""},{"$f":"IF($B32=\"\",\"\",IFERROR(INDEX('quantities report_secondary'!$D$2:$D$10003,SMALL(IF('quantities report_secondary'!$A$2:$A$10003=AH$6,ROW('quantities report_secondary'!$A$2:$A$10003)-1,\"\"),ROWS($B$8:$B32))),\"0\"))","v":""},"","","","","",0.9,"",""]

{"sheet":"Removals_Secondary","index":17,"n_rows":26,"n_cols":12,"rows_kept":26,"cut":false,"hidden":false,"merged":[]}
[]
[null,"TOTALS",{"$f":"SUM(C5:C28)","v":0},0,0,0,0,{"$f":"SUM(H5:H28)","v":0},{"$f":"SUM(I5:I28)","v":0},0,{"$f":"SUM(K5:K28)","v":0},0]
[null,"Station","Pavement Removed","Pavement Removed/Replaced","Total",null,null,"Topsoil Removed","Topsoil Removed/Replaced","Total"]
[null,null,"XS_TC_Exist Pvmt Layer 1 (removed): ","XS_TC_Exist Pvmt Layer 1 (removed and replaced): ","Total XS_TC_Exist Pvmt Layer 1: ","Pavement Removed","Pavement Removed/Replaced","XS_TC_Exist Topsoil (removed): ","XS_TC_Exist Topsoil (removed and replaced): ","Total XS_TC_Exist Topsoil: ","Topsoil Removed","Topsoil Removed/Replaced"]
[null,{"$f":"IFERROR(INDEX('manual inputs_secondary'!M:M,SMALL(IF('manual inputs_secondary'!M:M<>\"\",ROW('manual inputs_secondary'!M:M)),ROW(3:3))),\"\")","v":""},{"$f":"(IF($B5=\"\",\"\",VALUE(IFERROR(INDEX('quantities report_secondary'!$D$2:$D$10003,SMALL(IF('quantities report_secondary'!$A$2:$A$10003=C$4,ROW('quantities report_secondary'!$A$2:$A$10003)-1,\"\"),ROWS($B$9:$B9))),\"0\"))))","v":""},{"$f":"(IF($B5=\"\",\"\",VALUE(IFERROR(INDEX('quantities report_secondary'!$D$2:$D$10003,SMALL(IF('quantities report_secondary'!$A$2:$A$10003=D$4,ROW('quantities report_secondary'!$A$2:$A$10003)-1,\"\"),ROWS($B$9:$B9))),\"0\"))))","v":""},{"$f":"(IF($B5=\"\",\"\",VALUE(IFERROR(INDEX('quantities report_secondary'!$D$2:$D$10003,SMALL(IF('quantities report_secondary'!$A$2:$A$10003=E$4,ROW('quantities report_secondary'!$A$2:$A$10003)-1,\"\"),ROWS($B$9:$B9))),\"0\"))))","v":""},{"$f":"IF(C5=0,(E5-D5),C5)","v":""},{"$f":"IF(D5=0,(E5-C5),D5)","v":""},{"$f":"(IF($B5=\"\",\"\",VALUE(IFERROR(INDEX('quantities report_secondary'!$D$2:$D$10003,SMALL(IF('quantities report_secondary'!$A$2:$A$10003=H$4,ROW('quantities report_secondary'!$A$2:$A$10003)-1,\"\"),ROWS($B$9:$B9))),\"0\"))))","v":""},{"$f":"(IF($B5=\"\",\"\",VALUE(IFERROR(INDEX('quantities report_secondary'!$D$2:$D$10003,SMALL(IF('quantities report_secondary'!$A$2:$A$10003=I$4,ROW('quantities report_secondary'!$A$2:$A$10003)-1,\"\"),ROWS($B$9:$B9))),\"0\"))))","v":""},{"$f":"(IF($B5=\"\",\"\",VALUE(IFERROR(INDEX('quantities report_secondary'!$D$2:$D$10003,SMALL(IF('quantities report_secondary'!$A$2:$A$10003=J$4,ROW('quantities report_secondary'!$A$2:$A$10003)-1,\"\"),ROWS($B$9:$B9))),\"0\"))))","v":""},{"$f":"IF(H5=0,(J5-I5),H5)","v":""},{"$f":"IF(I5=0,(J5-H5),I5)","v":""}]
[null,{"$f":"IFERROR(INDEX('manual inputs_secondary'!M:M,SMALL(IF('manual inputs_secondary'!M:M<>\"\",ROW('manual inputs_secondary'!M:M)),ROW(4:4))),\"\")","v":""},{"$f":"(IF($B6=\"\",\"\",VALUE(IFERROR(INDEX('quantities report_secondary'!$D$2:$D$10003,SMALL(IF('quantities report_secondary'!$A$2:$A$10003=C$4,ROW('quantities report_secondary'!$A$2:$A$10003)-1,\"\"),ROWS($B$9:$B10))),\"0\"))))","v":""},{"$f":"(IF($B6=\"\",\"\",VALUE(IFERROR(INDEX('quantities report_secondary'!$D$2:$D$10003,SMALL(IF('quantities report_secondary'!$A$2:$A$10003=D$4,ROW('quantities report_secondary'!$A$2:$A$10003)-1,\"\"),ROWS($B$9:$B10))),\"0\"))))","v":""},{"$f":"(IF($B6=\"\",\"\",VALUE(IFERROR(INDEX('quantities report_secondary'!$D$2:$D$10003,SMALL(IF('quantities report_secondary'!$A$2:$A$10003=E$4,ROW('quantities report_secondary'!$A$2:$A$10003)-1,\"\"),ROWS($B$9:$B10))),\"0\"))))","v":""},{"$f":"IF(C6=0,(E6-D6),C6)","v":""},{"$f":"IF(D6=0,(E6-C6),D6)","v":""},{"$f":"(IF($B6=\"\",\"\",VALUE(IFERROR(INDEX('quantities report_secondary'!$D$2:$D$10003,SMALL(IF('quantities report_secondary'!$A$2:$A$10003=H$4,ROW('quantities report_secondary'!$A$2:$A$10003)-1,\"\"),ROWS($B$9:$B10))),\"0\"))))","v":""},{"$f":"(IF($B6=\"\",\"\",VALUE(IFERROR(INDEX('quantities report_secondary'!$D$2:$D$10003,SMALL(IF('quantities report_secondary'!$A$2:$A$10003=I$4,ROW('quantities report_secondary'!$A$2:$A$10003)-1,\"\"),ROWS($B$9:$B10))),\"0\"))))","v":""},{"$f":"(IF($B6=\"\",\"\",VALUE(IFERROR(INDEX('quantities report_secondary'!$D$2:$D$10003,SMALL(IF('quantities report_secondary'!$A$2:$A$10003=J$4,ROW('quantities report_secondary'!$A$2:$A$10003)-1,\"\"),ROWS($B$9:$B10))),\"0\"))))","v":""},{"$f":"IF(H6=0,(J6-I6),H6)","v":""},{"$f":"IF(I6=0,(J6-H6),I6)","v":""}]
[null,{"$f":"IFERROR(INDEX('manual inputs_secondary'!M:M,SMALL(IF('manual inputs_secondary'!M:M<>\"\",ROW('manual inputs_secondary'!M:M)),ROW(5:5))),\"\")","v":""},{"$f":"(IF($B7=\"\",\"\",VALUE(IFERROR(INDEX('quantities report_secondary'!$D$2:$D$10003,SMALL(IF('quantities report_secondary'!$A$2:$A$10003=C$4,ROW('quantities report_secondary'!$A$2:$A$10003)-1,\"\"),ROWS($B$9:$B11))),\"0\"))))","v":""},{"$f":"(IF($B7=\"\",\"\",VALUE(IFERROR(INDEX('quantities report_secondary'!$D$2:$D$10003,SMALL(IF('quantities report_secondary'!$A$2:$A$10003=D$4,ROW('quantities report_secondary'!$A$2:$A$10003)-1,\"\"),ROWS($B$9:$B11))),\"0\"))))","v":""},{"$f":"(IF($B7=\"\",\"\",VALUE(IFERROR(INDEX('quantities report_secondary'!$D$2:$D$10003,SMALL(IF('quantities report_secondary'!$A$2:$A$10003=E$4,ROW('quantities report_secondary'!$A$2:$A$10003)-1,\"\"),ROWS($B$9:$B11))),\"0\"))))","v":""},"","",{"$f":"(IF($B7=\"\",\"\",VALUE(IFERROR(INDEX('quantities report_secondary'!$D$2:$D$10003,SMALL(IF('quantities report_secondary'!$A$2:$A$10003=H$4,ROW('quantities report_secondary'!$A$2:$A$10003)-1,\"\"),ROWS($B$9:$B11))),\"0\"))))","v":""},{"$f":"(IF($B7=\"\",\"\",VALUE(IFERROR(INDEX('quantities report_secondary'!$D$2:$D$10003,SMALL(IF('quantities report_secondary'!$A$2:$A$10003=I$4,ROW('quantities report_secondary'!$A$2:$A$10003)-1,\"\"),ROWS($B$9:$B11))),\"0\"))))","v":""},{"$f":"(IF($B7=\"\",\"\",VALUE(IFERROR(INDEX('quantities report_secondary'!$D$2:$D$10003,SMALL(IF('quantities report_secondary'!$A$2:$A$10003=J$4,ROW('quantities report_secondary'!$A$2:$A$10003)-1,\"\"),ROWS($B$9:$B11))),\"0\"))))","v":""},"",""]
[null,{"$f":"IFERROR(INDEX('manual inputs_secondary'!M:M,SMALL(IF('manual inputs_secondary'!M:M<>\"\",ROW('manual inputs_secondary'!M:M)),ROW(6:6))),\"\")","v":""},{"$f":"(IF($B8=\"\",\"\",VALUE(IFERROR(INDEX('quantities report_secondary'!$D$2:$D$10003,SMALL(IF('quantities report_secondary'!$A$2:$A$10003=C$4,ROW('quantities report_secondary'!$A$2:$A$10003)-1,\"\"),ROWS($B$9:$B12))),\"0\"))))","v":""},{"$f":"(IF($B8=\"\",\"\",VALUE(IFERROR(INDEX('quantities report_secondary'!$D$2:$D$10003,SMALL(IF('quantities report_secondary'!$A$2:$A$10003=D$4,ROW('quantities report_secondary'!$A$2:$A$10003)-1,\"\"),ROWS($B$9:$B12))),\"0\"))))","v":""},{"$f":"(IF($B8=\"\",\"\",VALUE(IFERROR(INDEX('quantities report_secondary'!$D$2:$D$10003,SMALL(IF('quantities report_secondary'!$A$2:$A$10003=E$4,ROW('quantities report_secondary'!$A$2:$A$10003)-1,\"\"),ROWS($B$9:$B12))),\"0\"))))","v":""},"","",{"$f":"(IF($B8=\"\",\"\",VALUE(IFERROR(INDEX('quantities report_secondary'!$D$2:$D$10003,SMALL(IF('quantities report_secondary'!$A$2:$A$10003=H$4,ROW('quantities report_secondary'!$A$2:$A$10003)-1,\"\"),ROWS($B$9:$B12))),\"0\"))))","v":""},{"$f":"(IF($B8=\"\",\"\",VALUE(IFERROR(INDEX('quantities report_secondary'!$D$2:$D$10003,SMALL(IF('quantities report_secondary'!$A$2:$A$10003=I$4,ROW('quantities report_secondary'!$A$2:$A$10003)-1,\"\"),ROWS($B$9:$B12))),\"0\"))))","v":""},{"$f":"(IF($B8=\"\",\"\",VALUE(IFERROR(INDEX('quantities report_secondary'!$D$2:$D$10003,SMALL(IF('quantities report_secondary'!$A$2:$A$10003=J$4,ROW('quantities report_secondary'!$A$2:$A$10003)-1,\"\"),ROWS($B$9:$B12))),\"0\"))))","v":""},"",""]
[null,{"$f":"IFERROR(INDEX('manual inputs_secondary'!M:M,SMALL(IF('manual inputs_secondary'!M:M<>\"\",ROW('manual inputs_secondary'!M:M)),ROW(7:7))),\"\")","v":""},{"$f":"(IF($B9=\"\",\"\",VALUE(IFERROR(INDEX('quantities report_secondary'!$D$2:$D$10003,SMALL(IF('quantities report_secondary'!$A$2:$A$10003=C$4,ROW('quantities report_secondary'!$A$2:$A$10003)-1,\"\"),ROWS($B$9:$B13))),\"0\"))))","v":""},{"$f":"(IF($B9=\"\",\"\",VALUE(IFERROR(INDEX('quantities report_secondary'!$D$2:$D$10003,SMALL(IF('quantities report_secondary'!$A$2:$A$10003=D$4,ROW('quantities report_secondary'!$A$2:$A$10003)-1,\"\"),ROWS($B$9:$B13))),\"0\"))))","v":""},{"$f":"(IF($B9=\"\",\"\",VALUE(IFERROR(INDEX('quantities report_secondary'!$D$2:$D$10003,SMALL(IF('quantities report_secondary'!$A$2:$A$10003=E$4,ROW('quantities report_secondary'!$A$2:$A$10003)-1,\"\"),ROWS($B$9:$B13))),\"0\"))))","v":""},"","",{"$f":"(IF($B9=\"\",\"\",VALUE(IFERROR(INDEX('quantities report_secondary'!$D$2:$D$10003,SMALL(IF('quantities report_secondary'!$A$2:$A$10003=H$4,ROW('quantities report_secondary'!$A$2:$A$10003)-1,\"\"),ROWS($B$9:$B13))),\"0\"))))","v":""},{"$f":"(IF($B9=\"\",\"\",VALUE(IFERROR(INDEX('quantities report_secondary'!$D$2:$D$10003,SMALL(IF('quantities report_secondary'!$A$2:$A$10003=I$4,ROW('quantities report_secondary'!$A$2:$A$10003)-1,\"\"),ROWS($B$9:$B13))),\"0\"))))","v":""},{"$f":"(IF($B9=\"\",\"\",VALUE(IFERROR(INDEX('quantities report_secondary'!$D$2:$D$10003,SMALL(IF('quantities report_secondary'!$A$2:$A$10003=J$4,ROW('quantities report_secondary'!$A$2:$A$10003)-1,\"\"),ROWS($B$9:$B13))),\"0\"))))","v":""},"",""]
[null,{"$f":"IFERROR(INDEX('manual inputs_secondary'!M:M,SMALL(IF('manual inputs_secondary'!M:M<>\"\",ROW('manual inputs_secondary'!M:M)),ROW(8:8))),\"\")","v":""},{"$f":"(IF($B10=\"\",\"\",VALUE(IFERROR(INDEX('quantities report_secondary'!$D$2:$D$10003,SMALL(IF('quantities report_secondary'!$A$2:$A$10003=C$4,ROW('quantities report_secondary'!$A$2:$A$10003)-1,\"\"),ROWS($B$9:$B14))),\"0\"))))","v":""},{"$f":"(IF($B10=\"\",\"\",VALUE(IFERROR(INDEX('quantities report_secondary'!$D$2:$D$10003,SMALL(IF('quantities report_secondary'!$A$2:$A$10003=D$4,ROW('quantities report_secondary'!$A$2:$A$10003)-1,\"\"),ROWS($B$9:$B14))),\"0\"))))","v":""},{"$f":"(IF($B10=\"\",\"\",VALUE(IFERROR(INDEX('quantities report_secondary'!$D$2:$D$10003,SMALL(IF('quantities report_secondary'!$A$2:$A$10003=E$4,ROW('quantities report_secondary'!$A$2:$A$10003)-1,\"\"),ROWS($B$9:$B14))),\"0\"))))","v":""},"","",{"$f":"(IF($B10=\"\",\"\",VALUE(IFERROR(INDEX('quantities report_secondary'!$D$2:$D$10003,SMALL(IF('quantities report_secondary'!$A$2:$A$10003=H$4,ROW('quantities report_secondary'!$A$2:$A$10003)-1,\"\"),ROWS($B$9:$B14))),\"0\"))))","v":""},{"$f":"(IF($B10=\"\",\"\",VALUE(IFERROR(INDEX('quantities report_secondary'!$D$2:$D$10003,SMALL(IF('quantities report_secondary'!$A$2:$A$10003=I$4,ROW('quantities report_secondary'!$A$2:$A$10003)-1,\"\"),ROWS($B$9:$B14))),\"0\"))))","v":""},{"$f":"(IF($B10=\"\",\"\",VALUE(IFERROR(INDEX('quantities report_secondary'!$D$2:$D$10003,SMALL(IF('quantities report_secondary'!$A$2:$A$10003=J$4,ROW('quantities report_secondary'!$A$2:$A$10003)-1,\"\"),ROWS($B$9:$B14))),\"0\"))))","v":""},"",""]
[null,{"$f":"IFERROR(INDEX('manual inputs_secondary'!M:M,SMALL(IF('manual inputs_secondary'!M:M<>\"\",ROW('manual inputs_secondary'!M:M)),ROW(9:9))),\"\")","v":""},{"$f":"(IF($B11=\"\",\"\",VALUE(IFERROR(INDEX('quantities report_secondary'!$D$2:$D$10003,SMALL(IF('quantities report_secondary'!$A$2:$A$10003=C$4,ROW('quantities report_secondary'!$A$2:$A$10003)-1,\"\"),ROWS($B$9:$B15))),\"0\"))))","v":""},{"$f":"(IF($B11=\"\",\"\",VALUE(IFERROR(INDEX('quantities report_secondary'!$D$2:$D$10003,SMALL(IF('quantities report_secondary'!$A$2:$A$10003=D$4,ROW('quantities report_secondary'!$A$2:$A$10003)-1,\"\"),ROWS($B$9:$B15))),\"0\"))))","v":""},{"$f":"(IF($B11=\"\",\"\",VALUE(IFERROR(INDEX('quantities report_secondary'!$D$2:$D$10003,SMALL(IF('quantities report_secondary'!$A$2:$A$10003=E$4,ROW('quantities report_secondary'!$A$2:$A$10003)-1,\"\"),ROWS($B$9:$B15))),\"0\"))))","v":""},"","",{"$f":"(IF($B11=\"\",\"\",VALUE(IFERROR(INDEX('quantities report_secondary'!$D$2:$D$10003,SMALL(IF('quantities report_secondary'!$A$2:$A$10003=H$4,ROW('quantities report_secondary'!$A$2:$A$10003)-1,\"\"),ROWS($B$9:$B15))),\"0\"))))","v":""},{"$f":"(IF($B11=\"\",\"\",VALUE(IFERROR(INDEX('quantities report_secondary'!$D$2:$D$10003,SMALL(IF('quantities report_secondary'!$A$2:$A$10003=I$4,ROW('quantities report_secondary'!$A$2:$A$10003)-1,\"\"),ROWS($B$9:$B15))),\"0\"))))","v":""},{"$f":"(IF($B11=\"\",\"\",VALUE(IFERROR(INDEX('quantities report_secondary'!$D$2:$D$10003,SMALL(IF('quantities report_secondary'!$A$2:$A$10003=J$4,ROW('quantities report_secondary'!$A$2:$A$10003)-1,\"\"),ROWS($B$9:$B15))),\"0\"))))","v":""},"",""]
[null,{"$f":"IFERROR(INDEX('manual inputs_secondary'!M:M,SMALL(IF('manual inputs_secondary'!M:M<>\"\",ROW('manual inputs_secondary'!M:M)),ROW(10:10))),\"\")","v":""},{"$f":"(IF($B12=\"\",\"\",VALUE(IFERROR(INDEX('quantities report_secondary'!$D$2:$D$10003,SMALL(IF('quantities report_secondary'!$A$2:$A$10003=C$4,ROW('quantities report_secondary'!$A$2:$A$10003)-1,\"\"),ROWS($B$9:$B16))),\"0\"))))","v":""},{"$f":"(IF($B12=\"\",\"\",VALUE(IFERROR(INDEX('quantities report_secondary'!$D$2:$D$10003,SMALL(IF('quantities report_secondary'!$A$2:$A$10003=D$4,ROW('quantities report_secondary'!$A$2:$A$10003)-1,\"\"),ROWS($B$9:$B16))),\"0\"))))","v":""},{"$f":"(IF($B12=\"\",\"\",VALUE(IFERROR(INDEX('quantities report_secondary'!$D$2:$D$10003,SMALL(IF('quantities report_secondary'!$A$2:$A$10003=E$4,ROW('quantities report_secondary'!$A$2:$A$10003)-1,\"\"),ROWS($B$9:$B16))),\"0\"))))","v":""},"","",{"$f":"(IF($B12=\"\",\"\",VALUE(IFERROR(INDEX('quantities report_secondary'!$D$2:$D$10003,SMALL(IF('quantities report_secondary'!$A$2:$A$10003=H$4,ROW('quantities report_secondary'!$A$2:$A$10003)-1,\"\"),ROWS($B$9:$B16))),\"0\"))))","v":""},{"$f":"(IF($B12=\"\",\"\",VALUE(IFERROR(INDEX('quantities report_secondary'!$D$2:$D$10003,SMALL(IF('quantities report_secondary'!$A$2:$A$10003=I$4,ROW('quantities report_secondary'!$A$2:$A$10003)-1,\"\"),ROWS($B$9:$B16))),\"0\"))))","v":""},{"$f":"(IF($B12=\"\",\"\",VALUE(IFERROR(INDEX('quantities report_secondary'!$D$2:$D$10003,SMALL(IF('quantities report_secondary'!$A$2:$A$10003=J$4,ROW('quantities report_secondary'!$A$2:$A$10003)-1,\"\"),ROWS($B$9:$B16))),\"0\"))))","v":""},"",""]
[null,{"$f":"IFERROR(INDEX('manual inputs_secondary'!M:M,SMALL(IF('manual inputs_secondary'!M:M<>\"\",ROW('manual inputs_secondary'!M:M)),ROW(11:11))),\"\")","v":""},{"$f":"(IF($B13=\"\",\"\",VALUE(IFERROR(INDEX('quantities report_secondary'!$D$2:$D$10003,SMALL(IF('quantities report_secondary'!$A$2:$A$10003=C$4,ROW('quantities report_secondary'!$A$2:$A$10003)-1,\"\"),ROWS($B$9:$B17))),\"0\"))))","v":""},{"$f":"(IF($B13=\"\",\"\",VALUE(IFERROR(INDEX('quantities report_secondary'!$D$2:$D$10003,SMALL(IF('quantities report_secondary'!$A$2:$A$10003=D$4,ROW('quantities report_secondary'!$A$2:$A$10003)-1,\"\"),ROWS($B$9:$B17))),\"0\"))))","v":""},{"$f":"(IF($B13=\"\",\"\",VALUE(IFERROR(INDEX('quantities report_secondary'!$D$2:$D$10003,SMALL(IF('quantities report_secondary'!$A$2:$A$10003=E$4,ROW('quantities report_secondary'!$A$2:$A$10003)-1,\"\"),ROWS($B$9:$B17))),\"0\"))))","v":""},"","",{"$f":"(IF($B13=\"\",\"\",VALUE(IFERROR(INDEX('quantities report_secondary'!$D$2:$D$10003,SMALL(IF('quantities report_secondary'!$A$2:$A$10003=H$4,ROW('quantities report_secondary'!$A$2:$A$10003)-1,\"\"),ROWS($B$9:$B17))),\"0\"))))","v":""},{"$f":"(IF($B13=\"\",\"\",VALUE(IFERROR(INDEX('quantities report_secondary'!$D$2:$D$10003,SMALL(IF('quantities report_secondary'!$A$2:$A$10003=I$4,ROW('quantities report_secondary'!$A$2:$A$10003)-1,\"\"),ROWS($B$9:$B17))),\"0\"))))","v":""},{"$f":"(IF($B13=\"\",\"\",VALUE(IFERROR(INDEX('quantities report_secondary'!$D$2:$D$10003,SMALL(IF('quantities report_secondary'!$A$2:$A$10003=J$4,ROW('quantities report_secondary'!$A$2:$A$10003)-1,\"\"),ROWS($B$9:$B17))),\"0\"))))","v":""},"",""]
[null,{"$f":"IFERROR(INDEX('manual inputs_secondary'!M:M,SMALL(IF('manual inputs_secondary'!M:M<>\"\",ROW('manual inputs_secondary'!M:M)),ROW(12:12))),\"\")","v":""},{"$f":"(IF($B14=\"\",\"\",VALUE(IFERROR(INDEX('quantities report_secondary'!$D$2:$D$10003,SMALL(IF('quantities report_secondary'!$A$2:$A$10003=C$4,ROW('quantities report_secondary'!$A$2:$A$10003)-1,\"\"),ROWS($B$9:$B18))),\"0\"))))","v":""},{"$f":"(IF($B14=\"\",\"\",VALUE(IFERROR(INDEX('quantities report_secondary'!$D$2:$D$10003,SMALL(IF('quantities report_secondary'!$A$2:$A$10003=D$4,ROW('quantities report_secondary'!$A$2:$A$10003)-1,\"\"),ROWS($B$9:$B18))),\"0\"))))","v":""},{"$f":"(IF($B14=\"\",\"\",VALUE(IFERROR(INDEX('quantities report_secondary'!$D$2:$D$10003,SMALL(IF('quantities report_secondary'!$A$2:$A$10003=E$4,ROW('quantities report_secondary'!$A$2:$A$10003)-1,\"\"),ROWS($B$9:$B18))),\"0\"))))","v":""},"","",{"$f":"(IF($B14=\"\",\"\",VALUE(IFERROR(INDEX('quantities report_secondary'!$D$2:$D$10003,SMALL(IF('quantities report_secondary'!$A$2:$A$10003=H$4,ROW('quantities report_secondary'!$A$2:$A$10003)-1,\"\"),ROWS($B$9:$B18))),\"0\"))))","v":""},{"$f":"(IF($B14=\"\",\"\",VALUE(IFERROR(INDEX('quantities report_secondary'!$D$2:$D$10003,SMALL(IF('quantities report_secondary'!$A$2:$A$10003=I$4,ROW('quantities report_secondary'!$A$2:$A$10003)-1,\"\"),ROWS($B$9:$B18))),\"0\"))))","v":""},{"$f":"(IF($B14=\"\",\"\",VALUE(IFERROR(INDEX('quantities report_secondary'!$D$2:$D$10003,SMALL(IF('quantities report_secondary'!$A$2:$A$10003=J$4,ROW('quantities report_secondary'!$A$2:$A$10003)-1,\"\"),ROWS($B$9:$B18))),\"0\"))))","v":""},"",""]
[null,{"$f":"IFERROR(INDEX('manual inputs_secondary'!M:M,SMALL(IF('manual inputs_secondary'!M:M<>\"\",ROW('manual inputs_secondary'!M:M)),ROW(13:13))),\"\")","v":""},{"$f":"(IF($B15=\"\",\"\",VALUE(IFERROR(INDEX('quantities report_secondary'!$D$2:$D$10003,SMALL(IF('quantities report_secondary'!$A$2:$A$10003=C$4,ROW('quantities report_secondary'!$A$2:$A$10003)-1,\"\"),ROWS($B$9:$B19))),\"0\"))))","v":""},{"$f":"(IF($B15=\"\",\"\",VALUE(IFERROR(INDEX('quantities report_secondary'!$D$2:$D$10003,SMALL(IF('quantities report_secondary'!$A$2:$A$10003=D$4,ROW('quantities report_secondary'!$A$2:$A$10003)-1,\"\"),ROWS($B$9:$B19))),\"0\"))))","v":""},{"$f":"(IF($B15=\"\",\"\",VALUE(IFERROR(INDEX('quantities report_secondary'!$D$2:$D$10003,SMALL(IF('quantities report_secondary'!$A$2:$A$10003=E$4,ROW('quantities report_secondary'!$A$2:$A$10003)-1,\"\"),ROWS($B$9:$B19))),\"0\"))))","v":""},"","",{"$f":"(IF($B15=\"\",\"\",VALUE(IFERROR(INDEX('quantities report_secondary'!$D$2:$D$10003,SMALL(IF('quantities report_secondary'!$A$2:$A$10003=H$4,ROW('quantities report_secondary'!$A$2:$A$10003)-1,\"\"),ROWS($B$9:$B19))),\"0\"))))","v":""},{"$f":"(IF($B15=\"\",\"\",VALUE(IFERROR(INDEX('quantities report_secondary'!$D$2:$D$10003,SMALL(IF('quantities report_secondary'!$A$2:$A$10003=I$4,ROW('quantities report_secondary'!$A$2:$A$10003)-1,\"\"),ROWS($B$9:$B19))),\"0\"))))","v":""},{"$f":"(IF($B15=\"\",\"\",VALUE(IFERROR(INDEX('quantities report_secondary'!$D$2:$D$10003,SMALL(IF('quantities report_secondary'!$A$2:$A$10003=J$4,ROW('quantities report_secondary'!$A$2:$A$10003)-1,\"\"),ROWS($B$9:$B19))),\"0\"))))","v":""},"",""]
[null,{"$f":"IFERROR(INDEX('manual inputs_secondary'!M:M,SMALL(IF('manual inputs_secondary'!M:M<>\"\",ROW('manual inputs_secondary'!M:M)),ROW(14:14))),\"\")","v":""},{"$f":"(IF($B16=\"\",\"\",VALUE(IFERROR(INDEX('quantities report_secondary'!$D$2:$D$10003,SMALL(IF('quantities report_secondary'!$A$2:$A$10003=C$4,ROW('quantities report_secondary'!$A$2:$A$10003)-1,\"\"),ROWS($B$9:$B20))),\"0\"))))","v":""},{"$f":"(IF($B16=\"\",\"\",VALUE(IFERROR(INDEX('quantities report_secondary'!$D$2:$D$10003,SMALL(IF('quantities report_secondary'!$A$2:$A$10003=D$4,ROW('quantities report_secondary'!$A$2:$A$10003)-1,\"\"),ROWS($B$9:$B20))),\"0\"))))","v":""},{"$f":"(IF($B16=\"\",\"\",VALUE(IFERROR(INDEX('quantities report_secondary'!$D$2:$D$10003,SMALL(IF('quantities report_secondary'!$A$2:$A$10003=E$4,ROW('quantities report_secondary'!$A$2:$A$10003)-1,\"\"),ROWS($B$9:$B20))),\"0\"))))","v":""},"","",{"$f":"(IF($B16=\"\",\"\",VALUE(IFERROR(INDEX('quantities report_secondary'!$D$2:$D$10003,SMALL(IF('quantities report_secondary'!$A$2:$A$10003=H$4,ROW('quantities report_secondary'!$A$2:$A$10003)-1,\"\"),ROWS($B$9:$B20))),\"0\"))))","v":""},{"$f":"(IF($B16=\"\",\"\",VALUE(IFERROR(INDEX('quantities report_secondary'!$D$2:$D$10003,SMALL(IF('quantities report_secondary'!$A$2:$A$10003=I$4,ROW('quantities report_secondary'!$A$2:$A$10003)-1,\"\"),ROWS($B$9:$B20))),\"0\"))))","v":""},{"$f":"(IF($B16=\"\",\"\",VALUE(IFERROR(INDEX('quantities report_secondary'!$D$2:$D$10003,SMALL(IF('quantities report_secondary'!$A$2:$A$10003=J$4,ROW('quantities report_secondary'!$A$2:$A$10003)-1,\"\"),ROWS($B$9:$B20))),\"0\"))))","v":""},"",""]
[null,{"$f":"IFERROR(INDEX('manual inputs_secondary'!M:M,SMALL(IF('manual inputs_secondary'!M:M<>\"\",ROW('manual inputs_secondary'!M:M)),ROW(15:15))),\"\")","v":""},{"$f":"(IF($B17=\"\",\"\",VALUE(IFERROR(INDEX('quantities report_secondary'!$D$2:$D$10003,SMALL(IF('quantities report_secondary'!$A$2:$A$10003=C$4,ROW('quantities report_secondary'!$A$2:$A$10003)-1,\"\"),ROWS($B$9:$B21))),\"0\"))))","v":""},{"$f":"(IF($B17=\"\",\"\",VALUE(IFERROR(INDEX('quantities report_secondary'!$D$2:$D$10003,SMALL(IF('quantities report_secondary'!$A$2:$A$10003=D$4,ROW('quantities report_secondary'!$A$2:$A$10003)-1,\"\"),ROWS($B$9:$B21))),\"0\"))))","v":""},{"$f":"(IF($B17=\"\",\"\",VALUE(IFERROR(INDEX('quantities report_secondary'!$D$2:$D$10003,SMALL(IF('quantities report_secondary'!$A$2:$A$10003=E$4,ROW('quantities report_secondary'!$A$2:$A$10003)-1,\"\"),ROWS($B$9:$B21))),\"0\"))))","v":""},"","",{"$f":"(IF($B17=\"\",\"\",VALUE(IFERROR(INDEX('quantities report_secondary'!$D$2:$D$10003,SMALL(IF('quantities report_secondary'!$A$2:$A$10003=H$4,ROW('quantities report_secondary'!$A$2:$A$10003)-1,\"\"),ROWS($B$9:$B21))),\"0\"))))","v":""},{"$f":"(IF($B17=\"\",\"\",VALUE(IFERROR(INDEX('quantities report_secondary'!$D$2:$D$10003,SMALL(IF('quantities report_secondary'!$A$2:$A$10003=I$4,ROW('quantities report_secondary'!$A$2:$A$10003)-1,\"\"),ROWS($B$9:$B21))),\"0\"))))","v":""},{"$f":"(IF($B17=\"\",\"\",VALUE(IFERROR(INDEX('quantities report_secondary'!$D$2:$D$10003,SMALL(IF('quantities report_secondary'!$A$2:$A$10003=J$4,ROW('quantities report_secondary'!$A$2:$A$10003)-1,\"\"),ROWS($B$9:$B21))),\"0\"))))","v":""},"",""]
[null,{"$f":"IFERROR(INDEX('manual inputs_secondary'!M:M,SMALL(IF('manual inputs_secondary'!M:M<>\"\",ROW('manual inputs_secondary'!M:M)),ROW(16:16))),\"\")","v":""},{"$f":"(IF($B18=\"\",\"\",VALUE(IFERROR(INDEX('quantities report_secondary'!$D$2:$D$10003,SMALL(IF('quantities report_secondary'!$A$2:$A$10003=C$4,ROW('quantities report_secondary'!$A$2:$A$10003)-1,\"\"),ROWS($B$9:$B22))),\"0\"))))","v":""},{"$f":"(IF($B18=\"\",\"\",VALUE(IFERROR(INDEX('quantities report_secondary'!$D$2:$D$10003,SMALL(IF('quantities report_secondary'!$A$2:$A$10003=D$4,ROW('quantities report_secondary'!$A$2:$A$10003)-1,\"\"),ROWS($B$9:$B22))),\"0\"))))","v":""},{"$f":"(IF($B18=\"\",\"\",VALUE(IFERROR(INDEX('quantities report_secondary'!$D$2:$D$10003,SMALL(IF('quantities report_secondary'!$A$2:$A$10003=E$4,ROW('quantities report_secondary'!$A$2:$A$10003)-1,\"\"),ROWS($B$9:$B22))),\"0\"))))","v":""},"","",{"$f":"(IF($B18=\"\",\"\",VALUE(IFERROR(INDEX('quantities report_secondary'!$D$2:$D$10003,SMALL(IF('quantities report_secondary'!$A$2:$A$10003=H$4,ROW('quantities report_secondary'!$A$2:$A$10003)-1,\"\"),ROWS($B$9:$B22))),\"0\"))))","v":""},{"$f":"(IF($B18=\"\",\"\",VALUE(IFERROR(INDEX('quantities report_secondary'!$D$2:$D$10003,SMALL(IF('quantities report_secondary'!$A$2:$A$10003=I$4,ROW('quantities report_secondary'!$A$2:$A$10003)-1,\"\"),ROWS($B$9:$B22))),\"0\"))))","v":""},{"$f":"(IF($B18=\"\",\"\",VALUE(IFERROR(INDEX('quantities report_secondary'!$D$2:$D$10003,SMALL(IF('quantities report_secondary'!$A$2:$A$10003=J$4,ROW('quantities report_secondary'!$A$2:$A$10003)-1,\"\"),ROWS($B$9:$B22))),\"0\"))))","v":""},"",""]
[null,{"$f":"IFERROR(INDEX('manual inputs_secondary'!M:M,SMALL(IF('manual inputs_secondary'!M:M<>\"\",ROW('manual inputs_secondary'!M:M)),ROW(17:17))),\"\")","v":""},{"$f":"(IF($B19=\"\",\"\",VALUE(IFERROR(INDEX('quantities report_secondary'!$D$2:$D$10003,SMALL(IF('quantities report_secondary'!$A$2:$A$10003=C$4,ROW('quantities report_secondary'!$A$2:$A$10003)-1,\"\"),ROWS($B$9:$B23))),\"0\"))))","v":""},{"$f":"(IF($B19=\"\",\"\",VALUE(IFERROR(INDEX('quantities report_secondary'!$D$2:$D$10003,SMALL(IF('quantities report_secondary'!$A$2:$A$10003=D$4,ROW('quantities report_secondary'!$A$2:$A$10003)-1,\"\"),ROWS($B$9:$B23))),\"0\"))))","v":""},{"$f":"(IF($B19=\"\",\"\",VALUE(IFERROR(INDEX('quantities report_secondary'!$D$2:$D$10003,SMALL(IF('quantities report_secondary'!$A$2:$A$10003=E$4,ROW('quantities report_secondary'!$A$2:$A$10003)-1,\"\"),ROWS($B$9:$B23))),\"0\"))))","v":""},"","",{"$f":"(IF($B19=\"\",\"\",VALUE(IFERROR(INDEX('quantities report_secondary'!$D$2:$D$10003,SMALL(IF('quantities report_secondary'!$A$2:$A$10003=H$4,ROW('quantities report_secondary'!$A$2:$A$10003)-1,\"\"),ROWS($B$9:$B23))),\"0\"))))","v":""},{"$f":"(IF($B19=\"\",\"\",VALUE(IFERROR(INDEX('quantities report_secondary'!$D$2:$D$10003,SMALL(IF('quantities report_secondary'!$A$2:$A$10003=I$4,ROW('quantities report_secondary'!$A$2:$A$10003)-1,\"\"),ROWS($B$9:$B23))),\"0\"))))","v":""},{"$f":"(IF($B19=\"\",\"\",VALUE(IFERROR(INDEX('quantities report_secondary'!$D$2:$D$10003,SMALL(IF('quantities report_secondary'!$A$2:$A$10003=J$4,ROW('quantities report_secondary'!$A$2:$A$10003)-1,\"\"),ROWS($B$9:$B23))),\"0\"))))","v":""},"",""]
[null,{"$f":"IFERROR(INDEX('manual inputs_secondary'!M:M,SMALL(IF('manual inputs_secondary'!M:M<>\"\",ROW('manual inputs_secondary'!M:M)),ROW(18:18))),\"\")","v":""},{"$f":"(IF($B20=\"\",\"\",VALUE(IFERROR(INDEX('quantities report_secondary'!$D$2:$D$10003,SMALL(IF('quantities report_secondary'!$A$2:$A$10003=C$4,ROW('quantities report_secondary'!$A$2:$A$10003)-1,\"\"),ROWS($B$9:$B24))),\"0\"))))","v":""},{"$f":"(IF($B20=\"\",\"\",VALUE(IFERROR(INDEX('quantities report_secondary'!$D$2:$D$10003,SMALL(IF('quantities report_secondary'!$A$2:$A$10003=D$4,ROW('quantities report_secondary'!$A$2:$A$10003)-1,\"\"),ROWS($B$9:$B24))),\"0\"))))","v":""},{"$f":"(IF($B20=\"\",\"\",VALUE(IFERROR(INDEX('quantities report_secondary'!$D$2:$D$10003,SMALL(IF('quantities report_secondary'!$A$2:$A$10003=E$4,ROW('quantities report_secondary'!$A$2:$A$10003)-1,\"\"),ROWS($B$9:$B24))),\"0\"))))","v":""},"","",{"$f":"(IF($B20=\"\",\"\",VALUE(IFERROR(INDEX('quantities report_secondary'!$D$2:$D$10003,SMALL(IF('quantities report_secondary'!$A$2:$A$10003=H$4,ROW('quantities report_secondary'!$A$2:$A$10003)-1,\"\"),ROWS($B$9:$B24))),\"0\"))))","v":""},{"$f":"(IF($B20=\"\",\"\",VALUE(IFERROR(INDEX('quantities report_secondary'!$D$2:$D$10003,SMALL(IF('quantities report_secondary'!$A$2:$A$10003=I$4,ROW('quantities report_secondary'!$A$2:$A$10003)-1,\"\"),ROWS($B$9:$B24))),\"0\"))))","v":""},{"$f":"(IF($B20=\"\",\"\",VALUE(IFERROR(INDEX('quantities report_secondary'!$D$2:$D$10003,SMALL(IF('quantities report_secondary'!$A$2:$A$10003=J$4,ROW('quantities report_secondary'!$A$2:$A$10003)-1,\"\"),ROWS($B$9:$B24))),\"0\"))))","v":""},"",""]
[null,{"$f":"IFERROR(INDEX('manual inputs_secondary'!M:M,SMALL(IF('manual inputs_secondary'!M:M<>\"\",ROW('manual inputs_secondary'!M:M)),ROW(19:19))),\"\")","v":""},{"$f":"(IF($B21=\"\",\"\",VALUE(IFERROR(INDEX('quantities report_secondary'!$D$2:$D$10003,SMALL(IF('quantities report_secondary'!$A$2:$A$10003=C$4,ROW('quantities report_secondary'!$A$2:$A$10003)-1,\"\"),ROWS($B$9:$B25))),\"0\"))))","v":""},{"$f":"(IF($B21=\"\",\"\",VALUE(IFERROR(INDEX('quantities report_secondary'!$D$2:$D$10003,SMALL(IF('quantities report_secondary'!$A$2:$A$10003=D$4,ROW('quantities report_secondary'!$A$2:$A$10003)-1,\"\"),ROWS($B$9:$B25))),\"0\"))))","v":""},{"$f":"(IF($B21=\"\",\"\",VALUE(IFERROR(INDEX('quantities report_secondary'!$D$2:$D$10003,SMALL(IF('quantities report_secondary'!$A$2:$A$10003=E$4,ROW('quantities report_secondary'!$A$2:$A$10003)-1,\"\"),ROWS($B$9:$B25))),\"0\"))))","v":""},"","",{"$f":"(IF($B21=\"\",\"\",VALUE(IFERROR(INDEX('quantities report_secondary'!$D$2:$D$10003,SMALL(IF('quantities report_secondary'!$A$2:$A$10003=H$4,ROW('quantities report_secondary'!$A$2:$A$10003)-1,\"\"),ROWS($B$9:$B25))),\"0\"))))","v":""},{"$f":"(IF($B21=\"\",\"\",VALUE(IFERROR(INDEX('quantities report_secondary'!$D$2:$D$10003,SMALL(IF('quantities report_secondary'!$A$2:$A$10003=I$4,ROW('quantities report_secondary'!$A$2:$A$10003)-1,\"\"),ROWS($B$9:$B25))),\"0\"))))","v":""},{"$f":"(IF($B21=\"\",\"\",VALUE(IFERROR(INDEX('quantities report_secondary'!$D$2:$D$10003,SMALL(IF('quantities report_secondary'!$A$2:$A$10003=J$4,ROW('quantities report_secondary'!$A$2:$A$10003)-1,\"\"),ROWS($B$9:$B25))),\"0\"))))","v":""},"",""]
[null,{"$f":"IFERROR(INDEX('manual inputs_secondary'!M:M,SMALL(IF('manual inputs_secondary'!M:M<>\"\",ROW('manual inputs_secondary'!M:M)),ROW(20:20))),\"\")","v":""},{"$f":"(IF($B22=\"\",\"\",VALUE(IFERROR(INDEX('quantities report_secondary'!$D$2:$D$10003,SMALL(IF('quantities report_secondary'!$A$2:$A$10003=C$4,ROW('quantities report_secondary'!$A$2:$A$10003)-1,\"\"),ROWS($B$9:$B26))),\"0\"))))","v":""},{"$f":"(IF($B22=\"\",\"\",VALUE(IFERROR(INDEX('quantities report_secondary'!$D$2:$D$10003,SMALL(IF('quantities report_secondary'!$A$2:$A$10003=D$4,ROW('quantities report_secondary'!$A$2:$A$10003)-1,\"\"),ROWS($B$9:$B26))),\"0\"))))","v":""},{"$f":"(IF($B22=\"\",\"\",VALUE(IFERROR(INDEX('quantities report_secondary'!$D$2:$D$10003,SMALL(IF('quantities report_secondary'!$A$2:$A$10003=E$4,ROW('quantities report_secondary'!$A$2:$A$10003)-1,\"\"),ROWS($B$9:$B26))),\"0\"))))","v":""},"","",{"$f":"(IF($B22=\"\",\"\",VALUE(IFERROR(INDEX('quantities report_secondary'!$D$2:$D$10003,SMALL(IF('quantities report_secondary'!$A$2:$A$10003=H$4,ROW('quantities report_secondary'!$A$2:$A$10003)-1,\"\"),ROWS($B$9:$B26))),\"0\"))))","v":""},{"$f":"(IF($B22=\"\",\"\",VALUE(IFERROR(INDEX('quantities report_secondary'!$D$2:$D$10003,SMALL(IF('quantities report_secondary'!$A$2:$A$10003=I$4,ROW('quantities report_secondary'!$A$2:$A$10003)-1,\"\"),ROWS($B$9:$B26))),\"0\"))))","v":""},{"$f":"(IF($B22=\"\",\"\",VALUE(IFERROR(INDEX('quantities report_secondary'!$D$2:$D$10003,SMALL(IF('quantities report_secondary'!$A$2:$A$10003=J$4,ROW('quantities report_secondary'!$A$2:$A$10003)-1,\"\"),ROWS($B$9:$B26))),\"0\"))))","v":""},"",""]
[null,{"$f":"IFERROR(INDEX('manual inputs_secondary'!M:M,SMALL(IF('manual inputs_secondary'!M:M<>\"\",ROW('manual inputs_secondary'!M:M)),ROW(21:21))),\"\")","v":""},{"$f":"(IF($B23=\"\",\"\",VALUE(IFERROR(INDEX('quantities report_secondary'!$D$2:$D$10003,SMALL(IF('quantities report_secondary'!$A$2:$A$10003=C$4,ROW('quantities report_secondary'!$A$2:$A$10003)-1,\"\"),ROWS($B$9:$B27))),\"0\"))))","v":""},{"$f":"(IF($B23=\"\",\"\",VALUE(IFERROR(INDEX('quantities report_secondary'!$D$2:$D$10003,SMALL(IF('quantities report_secondary'!$A$2:$A$10003=D$4,ROW('quantities report_secondary'!$A$2:$A$10003)-1,\"\"),ROWS($B$9:$B27))),\"0\"))))","v":""},{"$f":"(IF($B23=\"\",\"\",VALUE(IFERROR(INDEX('quantities report_secondary'!$D$2:$D$10003,SMALL(IF('quantities report_secondary'!$A$2:$A$10003=E$4,ROW('quantities report_secondary'!$A$2:$A$10003)-1,\"\"),ROWS($B$9:$B27))),\"0\"))))","v":""},"","",{"$f":"(IF($B23=\"\",\"\",VALUE(IFERROR(INDEX('quantities report_secondary'!$D$2:$D$10003,SMALL(IF('quantities report_secondary'!$A$2:$A$10003=H$4,ROW('quantities report_secondary'!$A$2:$A$10003)-1,\"\"),ROWS($B$9:$B27))),\"0\"))))","v":""},{"$f":"(IF($B23=\"\",\"\",VALUE(IFERROR(INDEX('quantities report_secondary'!$D$2:$D$10003,SMALL(IF('quantities report_secondary'!$A$2:$A$10003=I$4,ROW('quantities report_secondary'!$A$2:$A$10003)-1,\"\"),ROWS($B$9:$B27))),\"0\"))))","v":""},{"$f":"(IF($B23=\"\",\"\",VALUE(IFERROR(INDEX('quantities report_secondary'!$D$2:$D$10003,SMALL(IF('quantities report_secondary'!$A$2:$A$10003=J$4,ROW('quantities report_secondary'!$A$2:$A$10003)-1,\"\"),ROWS($B$9:$B27))),\"0\"))))","v":""},"",""]
[null,{"$f":"IFERROR(INDEX('manual inputs_secondary'!M:M,SMALL(IF('manual inputs_secondary'!M:M<>\"\",ROW('manual inputs_secondary'!M:M)),ROW(22:22))),\"\")","v":""},{"$f":"(IF($B24=\"\",\"\",VALUE(IFERROR(INDEX('quantities report_secondary'!$D$2:$D$10003,SMALL(IF('quantities report_secondary'!$A$2:$A$10003=C$4,ROW('quantities report_secondary'!$A$2:$A$10003)-1,\"\"),ROWS($B$9:$B28))),\"0\"))))","v":""},{"$f":"(IF($B24=\"\",\"\",VALUE(IFERROR(INDEX('quantities report_secondary'!$D$2:$D$10003,SMALL(IF('quantities report_secondary'!$A$2:$A$10003=D$4,ROW('quantities report_secondary'!$A$2:$A$10003)-1,\"\"),ROWS($B$9:$B28))),\"0\"))))","v":""},{"$f":"(IF($B24=\"\",\"\",VALUE(IFERROR(INDEX('quantities report_secondary'!$D$2:$D$10003,SMALL(IF('quantities report_secondary'!$A$2:$A$10003=E$4,ROW('quantities report_secondary'!$A$2:$A$10003)-1,\"\"),ROWS($B$9:$B28))),\"0\"))))","v":""},"","",{"$f":"(IF($B24=\"\",\"\",VALUE(IFERROR(INDEX('quantities report_secondary'!$D$2:$D$10003,SMALL(IF('quantities report_secondary'!$A$2:$A$10003=H$4,ROW('quantities report_secondary'!$A$2:$A$10003)-1,\"\"),ROWS($B$9:$B28))),\"0\"))))","v":""},{"$f":"(IF($B24=\"\",\"\",VALUE(IFERROR(INDEX('quantities report_secondary'!$D$2:$D$10003,SMALL(IF('quantities report_secondary'!$A$2:$A$10003=I$4,ROW('quantities report_secondary'!$A$2:$A$10003)-1,\"\"),ROWS($B$9:$B28))),\"0\"))))","v":""},{"$f":"(IF($B24=\"\",\"\",VALUE(IFERROR(INDEX('quantities report_secondary'!$D$2:$D$10003,SMALL(IF('quantities report_secondary'!$A$2:$A$10003=J$4,ROW('quantities report_secondary'!$A$2:$A$10003)-1,\"\"),ROWS($B$9:$B28))),\"0\"))))","v":""},"",""]
[null,{"$f":"IFERROR(INDEX('manual inputs_secondary'!M:M,SMALL(IF('manual inputs_secondary'!M:M<>\"\",ROW('manual inputs_secondary'!M:M)),ROW(23:23))),\"\")","v":""},{"$f":"(IF($B25=\"\",\"\",VALUE(IFERROR(INDEX('quantities report_secondary'!$D$2:$D$10003,SMALL(IF('quantities report_secondary'!$A$2:$A$10003=C$4,ROW('quantities report_secondary'!$A$2:$A$10003)-1,\"\"),ROWS($B$9:$B29))),\"0\"))))","v":""},{"$f":"(IF($B25=\"\",\"\",VALUE(IFERROR(INDEX('quantities report_secondary'!$D$2:$D$10003,SMALL(IF('quantities report_secondary'!$A$2:$A$10003=D$4,ROW('quantities report_secondary'!$A$2:$A$10003)-1,\"\"),ROWS($B$9:$B29))),\"0\"))))","v":""},{"$f":"(IF($B25=\"\",\"\",VALUE(IFERROR(INDEX('quantities report_secondary'!$D$2:$D$10003,SMALL(IF('quantities report_secondary'!$A$2:$A$10003=E$4,ROW('quantities report_secondary'!$A$2:$A$10003)-1,\"\"),ROWS($B$9:$B29))),\"0\"))))","v":""},"","",{"$f":"(IF($B25=\"\",\"\",VALUE(IFERROR(INDEX('quantities report_secondary'!$D$2:$D$10003,SMALL(IF('quantities report_secondary'!$A$2:$A$10003=H$4,ROW('quantities report_secondary'!$A$2:$A$10003)-1,\"\"),ROWS($B$9:$B29))),\"0\"))))","v":""},{"$f":"(IF($B25=\"\",\"\",VALUE(IFERROR(INDEX('quantities report_secondary'!$D$2:$D$10003,SMALL(IF('quantities report_secondary'!$A$2:$A$10003=I$4,ROW('quantities report_secondary'!$A$2:$A$10003)-1,\"\"),ROWS($B$9:$B29))),\"0\"))))","v":""},{"$f":"(IF($B25=\"\",\"\",VALUE(IFERROR(INDEX('quantities report_secondary'!$D$2:$D$10003,SMALL(IF('quantities report_secondary'!$A$2:$A$10003=J$4,ROW('quantities report_secondary'!$A$2:$A$10003)-1,\"\"),ROWS($B$9:$B29))),\"0\"))))","v":""},"",""]
[null,{"$f":"IFERROR(INDEX('manual inputs_secondary'!M:M,SMALL(IF('manual inputs_secondary'!M:M<>\"\",ROW('manual inputs_secondary'!M:M)),ROW(24:24))),\"\")","v":""},{"$f":"(IF($B26=\"\",\"\",VALUE(IFERROR(INDEX('quantities report_secondary'!$D$2:$D$10003,SMALL(IF('quantities report_secondary'!$A$2:$A$10003=C$4,ROW('quantities report_secondary'!$A$2:$A$10003)-1,\"\"),ROWS($B$9:$B30))),\"0\"))))","v":""},{"$f":"(IF($B26=\"\",\"\",VALUE(IFERROR(INDEX('quantities report_secondary'!$D$2:$D$10003,SMALL(IF('quantities report_secondary'!$A$2:$A$10003=D$4,ROW('quantities report_secondary'!$A$2:$A$10003)-1,\"\"),ROWS($B$9:$B30))),\"0\"))))","v":""},{"$f":"(IF($B26=\"\",\"\",VALUE(IFERROR(INDEX('quantities report_secondary'!$D$2:$D$10003,SMALL(IF('quantities report_secondary'!$A$2:$A$10003=E$4,ROW('quantities report_secondary'!$A$2:$A$10003)-1,\"\"),ROWS($B$9:$B30))),\"0\"))))","v":""},"","",{"$f":"(IF($B26=\"\",\"\",VALUE(IFERROR(INDEX('quantities report_secondary'!$D$2:$D$10003,SMALL(IF('quantities report_secondary'!$A$2:$A$10003=H$4,ROW('quantities report_secondary'!$A$2:$A$10003)-1,\"\"),ROWS($B$9:$B30))),\"0\"))))","v":""},{"$f":"(IF($B26=\"\",\"\",VALUE(IFERROR(INDEX('quantities report_secondary'!$D$2:$D$10003,SMALL(IF('quantities report_secondary'!$A$2:$A$10003=I$4,ROW('quantities report_secondary'!$A$2:$A$10003)-1,\"\"),ROWS($B$9:$B30))),\"0\"))))","v":""},{"$f":"(IF($B26=\"\",\"\",VALUE(IFERROR(INDEX('quantities report_secondary'!$D$2:$D$10003,SMALL(IF('quantities report_secondary'!$A$2:$A$10003=J$4,ROW('quantities report_secondary'!$A$2:$A$10003)-1,\"\"),ROWS($B$9:$B30))),\"0\"))))","v":""},"",""]

{"sheet":"Structure_Ex_Secondary","index":18,"n_rows":32,"n_cols":9,"rows_kept":32,"cut":false,"hidden":false,"merged":[[3,2,3,7],[3,8,5,8]]}
[]
[]
["TOTALS",null,{"$f":"SUM(C8:C32)","v":0},0,0,0,0,0,0]
[null,null,"Structure Excavation",null,null,null,null,null,"Total"]
[null,null,"Soil Nail","MSE Wall","GFMSE Wall","Rockery Wall","Concrete Walls","Guardwall"]
["ORD Component Name",null,"XS_TC_Soil Nail Wall Excavation: ","XS_TC_MSE Wall Excavation: ","XS_TC_GFMSE Wall Excavation: ","XS_TC_Rockery Wall Excavation: ","XS_TC_Wall Excavation: ","XS_TL_Guard Wall Excavation:"]
["Enter Start of Project",{"$f":"IFERROR(INDEX('manual inputs_secondary'!M:M,SMALL(IF('manual inputs_secondary'!M:M<>\"\",ROW('manual inputs_secondary'!M:M)),ROW(2:2))),\"\")","v":""}]
[null,{"$f":"IFERROR(INDEX('manual inputs_secondary'!M:M,SMALL(IF('manual inputs_secondary'!M:M<>\"\",ROW('manual inputs_secondary'!M:M)),ROW(3:3))),\"\")","v":""},{"$f":"IF($B8=\"\",\"\",IFERROR(INDEX('quantities report_secondary'!$D$2:$D$10003,SMALL(IF('quantities report_secondary'!$A$2:$A$10003=C$6,ROW('quantities report_secondary'!$A$2:$A$10003)-1,\"\"),ROWS($B$8:$B8))),\"0\"))","v":""},{"$f":"IF($B8=\"\",\"\",IFERROR(INDEX('quantities report_secondary'!$D$2:$D$10003,SMALL(IF('quantities report_secondary'!$A$2:$A$10003=D$6,ROW('quantities report_secondary'!$A$2:$A$10003)-1,\"\"),ROWS($B$8:$B8))),\"0\"))","v":""},{"$f":"IF($B8=\"\",\"\",IFERROR(INDEX('quantities report_secondary'!$D$2:$D$10003,SMALL(IF('quantities report_secondary'!$A$2:$A$10003=E$6,ROW('quantities report_secondary'!$A$2:$A$10003)-1,\"\"),ROWS($B$8:$B8))),\"0\"))","v":""},{"$f":"IF($B8=\"\",\"\",IFERROR(INDEX('quantities report_secondary'!$D$2:$D$10003,SMALL(IF('quantities report_secondary'!$A$2:$A$10003=F$6,ROW('quantities report_secondary'!$A$2:$A$10003)-1,\"\"),ROWS($B$8:$B8))),\"0\"))","v":""},{"$f":"IF($B8=\"\",\"\",IFERROR(INDEX('quantities report_secondary'!$D$2:$D$10003,SMALL(IF('quantities report_secondary'!$A$2:$A$10003=G$6,ROW('quantities report_secondary'!$A$2:$A$10003)-1,\"\"),ROWS($B$8:$B8))),\"0\"))","v":""},{"$f":"IF($B8=\"\",\"\",IFERROR(INDEX('quantities report_secondary'!$D$2:$D$10003,SMALL(IF('quantities report_secondary'!$A$2:$A$10003=H$6,ROW('quantities report_secondary'!$A$2:$A$10003)-1,\"\"),ROWS($B$8:$B8))),\"0\"))","v":""},{"$f":"IF(B8=\"\",\"\",SUM(C8:H8))","v":""}]
[null,{"$f":"IFERROR(INDEX('manual inputs_secondary'!M:M,SMALL(IF('manual inputs_secondary'!M:M<>\"\",ROW('manual inputs_secondary'!M:M)),ROW(4:4))),\"\")","v":""},{"$f":"IF($B9=\"\",\"\",IFERROR(INDEX('quantities report_secondary'!$D$2:$D$10003,SMALL(IF('quantities report_secondary'!$A$2:$A$10003=C$6,ROW('quantities report_secondary'!$A$2:$A$10003)-1,\"\"),ROWS($B$8:$B9))),\"0\"))","v":""},{"$f":"IF($B9=\"\",\"\",IFERROR(INDEX('quantities report_secondary'!$D$2:$D$10003,SMALL(IF('quantities report_secondary'!$A$2:$A$10003=D$6,ROW('quantities report_secondary'!$A$2:$A$10003)-1,\"\"),ROWS($B$8:$B9))),\"0\"))","v":""},{"$f":"IF($B9=\"\",\"\",IFERROR(INDEX('quantities report_secondary'!$D$2:$D$10003,SMALL(IF('quantities report_secondary'!$A$2:$A$10003=E$6,ROW('quantities report_secondary'!$A$2:$A$10003)-1,\"\"),ROWS($B$8:$B9))),\"0\"))","v":""},{"$f":"IF($B9=\"\",\"\",IFERROR(INDEX('quantities report_secondary'!$D$2:$D$10003,SMALL(IF('quantities report_secondary'!$A$2:$A$10003=F$6,ROW('quantities report_secondary'!$A$2:$A$10003)-1,\"\"),ROWS($B$8:$B9))),\"0\"))","v":""},{"$f":"IF($B9=\"\",\"\",IFERROR(INDEX('quantities report_secondary'!$D$2:$D$10003,SMALL(IF('quantities report_secondary'!$A$2:$A$10003=G$6,ROW('quantities report_secondary'!$A$2:$A$10003)-1,\"\"),ROWS($B$8:$B9))),\"0\"))","v":""},{"$f":"IF($B9=\"\",\"\",IFERROR(INDEX('quantities report_secondary'!$D$2:$D$10003,SMALL(IF('quantities report_secondary'!$A$2:$A$10003=H$6,ROW('quantities report_secondary'!$A$2:$A$10003)-1,\"\"),ROWS($B$8:$B9))),\"0\"))","v":""},{"$f":"IF(B9=\"\",\"\",SUM(C9:H9))","v":""}]
[null,{"$f":"IFERROR(INDEX('manual inputs_secondary'!M:M,SMALL(IF('manual inputs_secondary'!M:M<>\"\",ROW('manual inputs_secondary'!M:M)),ROW(5:5))),\"\")","v":""},{"$f":"IF($B10=\"\",\"\",IFERROR(INDEX('quantities report_secondary'!$D$2:$D$10003,SMALL(IF('quantities report_secondary'!$A$2:$A$10003=C$6,ROW('quantities report_secondary'!$A$2:$A$10003)-1,\"\"),ROWS($B$8:$B10))),\"0\"))","v":""},{"$f":"IF($B10=\"\",\"\",IFERROR(INDEX('quantities report_secondary'!$D$2:$D$10003,SMALL(IF('quantities report_secondary'!$A$2:$A$10003=D$6,ROW('quantities report_secondary'!$A$2:$A$10003)-1,\"\"),ROWS($B$8:$B10))),\"0\"))","v":""},{"$f":"IF($B10=\"\",\"\",IFERROR(INDEX('quantities report_secondary'!$D$2:$D$10003,SMALL(IF('quantities report_secondary'!$A$2:$A$10003=E$6,ROW('quantities report_secondary'!$A$2:$A$10003)-1,\"\"),ROWS($B$8:$B10))),\"0\"))","v":""},{"$f":"IF($B10=\"\",\"\",IFERROR(INDEX('quantities report_secondary'!$D$2:$D$10003,SMALL(IF('quantities report_secondary'!$A$2:$A$10003=F$6,ROW('quantities report_secondary'!$A$2:$A$10003)-1,\"\"),ROWS($B$8:$B10))),\"0\"))","v":""},{"$f":"IF($B10=\"\",\"\",IFERROR(INDEX('quantities report_secondary'!$D$2:$D$10003,SMALL(IF('quantities report_secondary'!$A$2:$A$10003=G$6,ROW('quantities report_secondary'!$A$2:$A$10003)-1,\"\"),ROWS($B$8:$B10))),\"0\"))","v":""},{"$f":"IF($B10=\"\",\"\",IFERROR(INDEX('quantities report_secondary'!$D$2:$D$10003,SMALL(IF('quantities report_secondary'!$A$2:$A$10003=H$6,ROW('quantities report_secondary'!$A$2:$A$10003)-1,\"\"),ROWS($B$8:$B10))),\"0\"))","v":""},{"$f":"IF(B10=\"\",\"\",SUM(C10:H10))","v":""}]
[null,{"$f":"IFERROR(INDEX('manual inputs_secondary'!M:M,SMALL(IF('manual inputs_secondary'!M:M<>\"\",ROW('manual inputs_secondary'!M:M)),ROW(6:6))),\"\")","v":""},{"$f":"IF($B11=\"\",\"\",IFERROR(INDEX('quantities report_secondary'!$D$2:$D$10003,SMALL(IF('quantities report_secondary'!$A$2:$A$10003=C$6,ROW('quantities report_secondary'!$A$2:$A$10003)-1,\"\"),ROWS($B$8:$B11))),\"0\"))","v":""},{"$f":"IF($B11=\"\",\"\",IFERROR(INDEX('quantities report_secondary'!$D$2:$D$10003,SMALL(IF('quantities report_secondary'!$A$2:$A$10003=D$6,ROW('quantities report_secondary'!$A$2:$A$10003)-1,\"\"),ROWS($B$8:$B11))),\"0\"))","v":""},{"$f":"IF($B11=\"\",\"\",IFERROR(INDEX('quantities report_secondary'!$D$2:$D$10003,SMALL(IF('quantities report_secondary'!$A$2:$A$10003=E$6,ROW('quantities report_secondary'!$A$2:$A$10003)-1,\"\"),ROWS($B$8:$B11))),\"0\"))","v":""},{"$f":"IF($B11=\"\",\"\",IFERROR(INDEX('quantities report_secondary'!$D$2:$D$10003,SMALL(IF('quantities report_secondary'!$A$2:$A$10003=F$6,ROW('quantities report_secondary'!$A$2:$A$10003)-1,\"\"),ROWS($B$8:$B11))),\"0\"))","v":""},{"$f":"IF($B11=\"\",\"\",IFERROR(INDEX('quantities report_secondary'!$D$2:$D$10003,SMALL(IF('quantities report_secondary'!$A$2:$A$10003=G$6,ROW('quantities report_secondary'!$A$2:$A$10003)-1,\"\"),ROWS($B$8:$B11))),\"0\"))","v":""},{"$f":"IF($B11=\"\",\"\",IFERROR(INDEX('quantities report_secondary'!$D$2:$D$10003,SMALL(IF('quantities report_secondary'!$A$2:$A$10003=H$6,ROW('quantities report_secondary'!$A$2:$A$10003)-1,\"\"),ROWS($B$8:$B11))),\"0\"))","v":""},{"$f":"IF(B11=\"\",\"\",SUM(C11:H11))","v":""}]
[null,{"$f":"IFERROR(INDEX('manual inputs_secondary'!M:M,SMALL(IF('manual inputs_secondary'!M:M<>\"\",ROW('manual inputs_secondary'!M:M)),ROW(7:7))),\"\")","v":""},{"$f":"IF($B12=\"\",\"\",IFERROR(INDEX('quantities report_secondary'!$D$2:$D$10003,SMALL(IF('quantities report_secondary'!$A$2:$A$10003=C$6,ROW('quantities report_secondary'!$A$2:$A$10003)-1,\"\"),ROWS($B$8:$B12))),\"0\"))","v":""},{"$f":"IF($B12=\"\",\"\",IFERROR(INDEX('quantities report_secondary'!$D$2:$D$10003,SMALL(IF('quantities report_secondary'!$A$2:$A$10003=D$6,ROW('quantities report_secondary'!$A$2:$A$10003)-1,\"\"),ROWS($B$8:$B12))),\"0\"))","v":""},{"$f":"IF($B12=\"\",\"\",IFERROR(INDEX('quantities report_secondary'!$D$2:$D$10003,SMALL(IF('quantities report_secondary'!$A$2:$A$10003=E$6,ROW('quantities report_secondary'!$A$2:$A$10003)-1,\"\"),ROWS($B$8:$B12))),\"0\"))","v":""},{"$f":"IF($B12=\"\",\"\",IFERROR(INDEX('quantities report_secondary'!$D$2:$D$10003,SMALL(IF('quantities report_secondary'!$A$2:$A$10003=F$6,ROW('quantities report_secondary'!$A$2:$A$10003)-1,\"\"),ROWS($B$8:$B12))),\"0\"))","v":""},{"$f":"IF($B12=\"\",\"\",IFERROR(INDEX('quantities report_secondary'!$D$2:$D$10003,SMALL(IF('quantities report_secondary'!$A$2:$A$10003=G$6,ROW('quantities report_secondary'!$A$2:$A$10003)-1,\"\"),ROWS($B$8:$B12))),\"0\"))","v":""},{"$f":"IF($B12=\"\",\"\",IFERROR(INDEX('quantities report_secondary'!$D$2:$D$10003,SMALL(IF('quantities report_secondary'!$A$2:$A$10003=H$6,ROW('quantities report_secondary'!$A$2:$A$10003)-1,\"\"),ROWS($B$8:$B12))),\"0\"))","v":""},{"$f":"IF(B12=\"\",\"\",SUM(C12:H12))","v":""}]
[null,{"$f":"IFERROR(INDEX('manual inputs_secondary'!M:M,SMALL(IF('manual inputs_secondary'!M:M<>\"\",ROW('manual inputs_secondary'!M:M)),ROW(8:8))),\"\")","v":""},{"$f":"IF($B13=\"\",\"\",IFERROR(INDEX('quantities report_secondary'!$D$2:$D$10003,SMALL(IF('quantities report_secondary'!$A$2:$A$10003=C$6,ROW('quantities report_secondary'!$A$2:$A$10003)-1,\"\"),ROWS($B$8:$B13))),\"0\"))","v":""},{"$f":"IF($B13=\"\",\"\",IFERROR(INDEX('quantities report_secondary'!$D$2:$D$10003,SMALL(IF('quantities report_secondary'!$A$2:$A$10003=D$6,ROW('quantities report_secondary'!$A$2:$A$10003)-1,\"\"),ROWS($B$8:$B13))),\"0\"))","v":""},{"$f":"IF($B13=\"\",\"\",IFERROR(INDEX('quantities report_secondary'!$D$2:$D$10003,SMALL(IF('quantities report_secondary'!$A$2:$A$10003=E$6,ROW('quantities report_secondary'!$A$2:$A$10003)-1,\"\"),ROWS($B$8:$B13))),\"0\"))","v":""},{"$f":"IF($B13=\"\",\"\",IFERROR(INDEX('quantities report_secondary'!$D$2:$D$10003,SMALL(IF('quantities report_secondary'!$A$2:$A$10003=F$6,ROW('quantities report_secondary'!$A$2:$A$10003)-1,\"\"),ROWS($B$8:$B13))),\"0\"))","v":""},{"$f":"IF($B13=\"\",\"\",IFERROR(INDEX('quantities report_secondary'!$D$2:$D$10003,SMALL(IF('quantities report_secondary'!$A$2:$A$10003=G$6,ROW('quantities report_secondary'!$A$2:$A$10003)-1,\"\"),ROWS($B$8:$B13))),\"0\"))","v":""},{"$f":"IF($B13=\"\",\"\",IFERROR(INDEX('quantities report_secondary'!$D$2:$D$10003,SMALL(IF('quantities report_secondary'!$A$2:$A$10003=H$6,ROW('quantities report_secondary'!$A$2:$A$10003)-1,\"\"),ROWS($B$8:$B13))),\"0\"))","v":""},{"$f":"IF(B13=\"\",\"\",SUM(C13:H13))","v":""}]
[null,{"$f":"IFERROR(INDEX('manual inputs_secondary'!M:M,SMALL(IF('manual inputs_secondary'!M:M<>\"\",ROW('manual inputs_secondary'!M:M)),ROW(9:9))),\"\")","v":""},{"$f":"IF($B14=\"\",\"\",IFERROR(INDEX('quantities report_secondary'!$D$2:$D$10003,SMALL(IF('quantities report_secondary'!$A$2:$A$10003=C$6,ROW('quantities report_secondary'!$A$2:$A$10003)-1,\"\"),ROWS($B$8:$B14))),\"0\"))","v":""},{"$f":"IF($B14=\"\",\"\",IFERROR(INDEX('quantities report_secondary'!$D$2:$D$10003,SMALL(IF('quantities report_secondary'!$A$2:$A$10003=D$6,ROW('quantities report_secondary'!$A$2:$A$10003)-1,\"\"),ROWS($B$8:$B14))),\"0\"))","v":""},{"$f":"IF($B14=\"\",\"\",IFERROR(INDEX('quantities report_secondary'!$D$2:$D$10003,SMALL(IF('quantities report_secondary'!$A$2:$A$10003=E$6,ROW('quantities report_secondary'!$A$2:$A$10003)-1,\"\"),ROWS($B$8:$B14))),\"0\"))","v":""},{"$f":"IF($B14=\"\",\"\",IFERROR(INDEX('quantities report_secondary'!$D$2:$D$10003,SMALL(IF('quantities report_secondary'!$A$2:$A$10003=F$6,ROW('quantities report_secondary'!$A$2:$A$10003)-1,\"\"),ROWS($B$8:$B14))),\"0\"))","v":""},{"$f":"IF($B14=\"\",\"\",IFERROR(INDEX('quantities report_secondary'!$D$2:$D$10003,SMALL(IF('quantities report_secondary'!$A$2:$A$10003=G$6,ROW('quantities report_secondary'!$A$2:$A$10003)-1,\"\"),ROWS($B$8:$B14))),\"0\"))","v":""},{"$f":"IF($B14=\"\",\"\",IFERROR(INDEX('quantities report_secondary'!$D$2:$D$10003,SMALL(IF('quantities report_secondary'!$A$2:$A$10003=H$6,ROW('quantities report_secondary'!$A$2:$A$10003)-1,\"\"),ROWS($B$8:$B14))),\"0\"))","v":""},{"$f":"IF(B14=\"\",\"\",SUM(C14:H14))","v":""}]
[null,{"$f":"IFERROR(INDEX('manual inputs_secondary'!M:M,SMALL(IF('manual inputs_secondary'!M:M<>\"\",ROW('manual inputs_secondary'!M:M)),ROW(10:10))),\"\")","v":""},{"$f":"IF($B15=\"\",\"\",IFERROR(INDEX('quantities report_secondary'!$D$2:$D$10003,SMALL(IF('quantities report_secondary'!$A$2:$A$10003=C$6,ROW('quantities report_secondary'!$A$2:$A$10003)-1,\"\"),ROWS($B$8:$B15))),\"0\"))","v":""},{"$f":"IF($B15=\"\",\"\",IFERROR(INDEX('quantities report_secondary'!$D$2:$D$10003,SMALL(IF('quantities report_secondary'!$A$2:$A$10003=D$6,ROW('quantities report_secondary'!$A$2:$A$10003)-1,\"\"),ROWS($B$8:$B15))),\"0\"))","v":""},{"$f":"IF($B15=\"\",\"\",IFERROR(INDEX('quantities report_secondary'!$D$2:$D$10003,SMALL(IF('quantities report_secondary'!$A$2:$A$10003=E$6,ROW('quantities report_secondary'!$A$2:$A$10003)-1,\"\"),ROWS($B$8:$B15))),\"0\"))","v":""},{"$f":"IF($B15=\"\",\"\",IFERROR(INDEX('quantities report_secondary'!$D$2:$D$10003,SMALL(IF('quantities report_secondary'!$A$2:$A$10003=F$6,ROW('quantities report_secondary'!$A$2:$A$10003)-1,\"\"),ROWS($B$8:$B15))),\"0\"))","v":""},{"$f":"IF($B15=\"\",\"\",IFERROR(INDEX('quantities report_secondary'!$D$2:$D$10003,SMALL(IF('quantities report_secondary'!$A$2:$A$10003=G$6,ROW('quantities report_secondary'!$A$2:$A$10003)-1,\"\"),ROWS($B$8:$B15))),\"0\"))","v":""},{"$f":"IF($B15=\"\",\"\",IFERROR(INDEX('quantities report_secondary'!$D$2:$D$10003,SMALL(IF('quantities report_secondary'!$A$2:$A$10003=H$6,ROW('quantities report_secondary'!$A$2:$A$10003)-1,\"\"),ROWS($B$8:$B15))),\"0\"))","v":""},{"$f":"IF(B15=\"\",\"\",SUM(C15:H15))","v":""}]
[null,{"$f":"IFERROR(INDEX('manual inputs_secondary'!M:M,SMALL(IF('manual inputs_secondary'!M:M<>\"\",ROW('manual inputs_secondary'!M:M)),ROW(11:11))),\"\")","v":""},{"$f":"IF($B16=\"\",\"\",IFERROR(INDEX('quantities report_secondary'!$D$2:$D$10003,SMALL(IF('quantities report_secondary'!$A$2:$A$10003=C$6,ROW('quantities report_secondary'!$A$2:$A$10003)-1,\"\"),ROWS($B$8:$B16))),\"0\"))","v":""},{"$f":"IF($B16=\"\",\"\",IFERROR(INDEX('quantities report_secondary'!$D$2:$D$10003,SMALL(IF('quantities report_secondary'!$A$2:$A$10003=D$6,ROW('quantities report_secondary'!$A$2:$A$10003)-1,\"\"),ROWS($B$8:$B16))),\"0\"))","v":""},{"$f":"IF($B16=\"\",\"\",IFERROR(INDEX('quantities report_secondary'!$D$2:$D$10003,SMALL(IF('quantities report_secondary'!$A$2:$A$10003=E$6,ROW('quantities report_secondary'!$A$2:$A$10003)-1,\"\"),ROWS($B$8:$B16))),\"0\"))","v":""},{"$f":"IF($B16=\"\",\"\",IFERROR(INDEX('quantities report_secondary'!$D$2:$D$10003,SMALL(IF('quantities report_secondary'!$A$2:$A$10003=F$6,ROW('quantities report_secondary'!$A$2:$A$10003)-1,\"\"),ROWS($B$8:$B16))),\"0\"))","v":""},{"$f":"IF($B16=\"\",\"\",IFERROR(INDEX('quantities report_secondary'!$D$2:$D$10003,SMALL(IF('quantities report_secondary'!$A$2:$A$10003=G$6,ROW('quantities report_secondary'!$A$2:$A$10003)-1,\"\"),ROWS($B$8:$B16))),\"0\"))","v":""},{"$f":"IF($B16=\"\",\"\",IFERROR(INDEX('quantities report_secondary'!$D$2:$D$10003,SMALL(IF('quantities report_secondary'!$A$2:$A$10003=H$6,ROW('quantities report_secondary'!$A$2:$A$10003)-1,\"\"),ROWS($B$8:$B16))),\"0\"))","v":""},{"$f":"IF(B16=\"\",\"\",SUM(C16:H16))","v":""}]
[null,{"$f":"IFERROR(INDEX('manual inputs_secondary'!M:M,SMALL(IF('manual inputs_secondary'!M:M<>\"\",ROW('manual inputs_secondary'!M:M)),ROW(12:12))),\"\")","v":""},{"$f":"IF($B17=\"\",\"\",IFERROR(INDEX('quantities report_secondary'!$D$2:$D$10003,SMALL(IF('quantities report_secondary'!$A$2:$A$10003=C$6,ROW('quantities report_secondary'!$A$2:$A$10003)-1,\"\"),ROWS($B$8:$B17))),\"0\"))","v":""},{"$f":"IF($B17=\"\",\"\",IFERROR(INDEX('quantities report_secondary'!$D$2:$D$10003,SMALL(IF('quantities report_secondary'!$A$2:$A$10003=D$6,ROW('quantities report_secondary'!$A$2:$A$10003)-1,\"\"),ROWS($B$8:$B17))),\"0\"))","v":""},{"$f":"IF($B17=\"\",\"\",IFERROR(INDEX('quantities report_secondary'!$D$2:$D$10003,SMALL(IF('quantities report_secondary'!$A$2:$A$10003=E$6,ROW('quantities report_secondary'!$A$2:$A$10003)-1,\"\"),ROWS($B$8:$B17))),\"0\"))","v":""},{"$f":"IF($B17=\"\",\"\",IFERROR(INDEX('quantities report_secondary'!$D$2:$D$10003,SMALL(IF('quantities report_secondary'!$A$2:$A$10003=F$6,ROW('quantities report_secondary'!$A$2:$A$10003)-1,\"\"),ROWS($B$8:$B17))),\"0\"))","v":""},{"$f":"IF($B17=\"\",\"\",IFERROR(INDEX('quantities report_secondary'!$D$2:$D$10003,SMALL(IF('quantities report_secondary'!$A$2:$A$10003=G$6,ROW('quantities report_secondary'!$A$2:$A$10003)-1,\"\"),ROWS($B$8:$B17))),\"0\"))","v":""},{"$f":"IF($B17=\"\",\"\",IFERROR(INDEX('quantities report_secondary'!$D$2:$D$10003,SMALL(IF('quantities report_secondary'!$A$2:$A$10003=H$6,ROW('quantities report_secondary'!$A$2:$A$10003)-1,\"\"),ROWS($B$8:$B17))),\"0\"))","v":""},{"$f":"IF(B17=\"\",\"\",SUM(C17:H17))","v":""}]
[null,{"$f":"IFERROR(INDEX('manual inputs_secondary'!M:M,SMALL(IF('manual inputs_secondary'!M:M<>\"\",ROW('manual inputs_secondary'!M:M)),ROW(13:13))),\"\")","v":""},{"$f":"IF($B18=\"\",\"\",IFERROR(INDEX('quantities report_secondary'!$D$2:$D$10003,SMALL(IF('quantities report_secondary'!$A$2:$A$10003=C$6,ROW('quantities report_secondary'!$A$2:$A$10003)-1,\"\"),ROWS($B$8:$B18))),\"0\"))","v":""},{"$f":"IF($B18=\"\",\"\",IFERROR(INDEX('quantities report_secondary'!$D$2:$D$10003,SMALL(IF('quantities report_secondary'!$A$2:$A$10003=D$6,ROW('quantities report_secondary'!$A$2:$A$10003)-1,\"\"),ROWS($B$8:$B18))),\"0\"))","v":""},{"$f":"IF($B18=\"\",\"\",IFERROR(INDEX('quantities report_secondary'!$D$2:$D$10003,SMALL(IF('quantities report_secondary'!$A$2:$A$10003=E$6,ROW('quantities report_secondary'!$A$2:$A$10003)-1,\"\"),ROWS($B$8:$B18))),\"0\"))","v":""},{"$f":"IF($B18=\"\",\"\",IFERROR(INDEX('quantities report_secondary'!$D$2:$D$10003,SMALL(IF('quantities report_secondary'!$A$2:$A$10003=F$6,ROW('quantities report_secondary'!$A$2:$A$10003)-1,\"\"),ROWS($B$8:$B18))),\"0\"))","v":""},{"$f":"IF($B18=\"\",\"\",IFERROR(INDEX('quantities report_secondary'!$D$2:$D$10003,SMALL(IF('quantities report_secondary'!$A$2:$A$10003=G$6,ROW('quantities report_secondary'!$A$2:$A$10003)-1,\"\"),ROWS($B$8:$B18))),\"0\"))","v":""},{"$f":"IF($B18=\"\",\"\",IFERROR(INDEX('quantities report_secondary'!$D$2:$D$10003,SMALL(IF('quantities report_secondary'!$A$2:$A$10003=H$6,ROW('quantities report_secondary'!$A$2:$A$10003)-1,\"\"),ROWS($B$8:$B18))),\"0\"))","v":""},{"$f":"IF(B18=\"\",\"\",SUM(C18:H18))","v":""}]
[null,{"$f":"IFERROR(INDEX('manual inputs_secondary'!M:M,SMALL(IF('manual inputs_secondary'!M:M<>\"\",ROW('manual inputs_secondary'!M:M)),ROW(14:14))),\"\")","v":""},{"$f":"IF($B19=\"\",\"\",IFERROR(INDEX('quantities report_secondary'!$D$2:$D$10003,SMALL(IF('quantities report_secondary'!$A$2:$A$10003=C$6,ROW('quantities report_secondary'!$A$2:$A$10003)-1,\"\"),ROWS($B$8:$B19))),\"0\"))","v":""},{"$f":"IF($B19=\"\",\"\",IFERROR(INDEX('quantities report_secondary'!$D$2:$D$10003,SMALL(IF('quantities report_secondary'!$A$2:$A$10003=D$6,ROW('quantities report_secondary'!$A$2:$A$10003)-1,\"\"),ROWS($B$8:$B19))),\"0\"))","v":""},{"$f":"IF($B19=\"\",\"\",IFERROR(INDEX('quantities report_secondary'!$D$2:$D$10003,SMALL(IF('quantities report_secondary'!$A$2:$A$10003=E$6,ROW('quantities report_secondary'!$A$2:$A$10003)-1,\"\"),ROWS($B$8:$B19))),\"0\"))","v":""},{"$f":"IF($B19=\"\",\"\",IFERROR(INDEX('quantities report_secondary'!$D$2:$D$10003,SMALL(IF('quantities report_secondary'!$A$2:$A$10003=F$6,ROW('quantities report_secondary'!$A$2:$A$10003)-1,\"\"),ROWS($B$8:$B19))),\"0\"))","v":""},{"$f":"IF($B19=\"\",\"\",IFERROR(INDEX('quantities report_secondary'!$D$2:$D$10003,SMALL(IF('quantities report_secondary'!$A$2:$A$10003=G$6,ROW('quantities report_secondary'!$A$2:$A$10003)-1,\"\"),ROWS($B$8:$B19))),\"0\"))","v":""},{"$f":"IF($B19=\"\",\"\",IFERROR(INDEX('quantities report_secondary'!$D$2:$D$10003,SMALL(IF('quantities report_secondary'!$A$2:$A$10003=H$6,ROW('quantities report_secondary'!$A$2:$A$10003)-1,\"\"),ROWS($B$8:$B19))),\"0\"))","v":""},{"$f":"IF(B19=\"\",\"\",SUM(C19:H19))","v":""}]
[null,{"$f":"IFERROR(INDEX('manual inputs_secondary'!M:M,SMALL(IF('manual inputs_secondary'!M:M<>\"\",ROW('manual inputs_secondary'!M:M)),ROW(15:15))),\"\")","v":""},{"$f":"IF($B20=\"\",\"\",IFERROR(INDEX('quantities report_secondary'!$D$2:$D$10003,SMALL(IF('quantities report_secondary'!$A$2:$A$10003=C$6,ROW('quantities report_secondary'!$A$2:$A$10003)-1,\"\"),ROWS($B$8:$B20))),\"0\"))","v":""},{"$f":"IF($B20=\"\",\"\",IFERROR(INDEX('quantities report_secondary'!$D$2:$D$10003,SMALL(IF('quantities report_secondary'!$A$2:$A$10003=D$6,ROW('quantities report_secondary'!$A$2:$A$10003)-1,\"\"),ROWS($B$8:$B20))),\"0\"))","v":""},{"$f":"IF($B20=\"\",\"\",IFERROR(INDEX('quantities report_secondary'!$D$2:$D$10003,SMALL(IF('quantities report_secondary'!$A$2:$A$10003=E$6,ROW('quantities report_secondary'!$A$2:$A$10003)-1,\"\"),ROWS($B$8:$B20))),\"0\"))","v":""},{"$f":"IF($B20=\"\",\"\",IFERROR(INDEX('quantities report_secondary'!$D$2:$D$10003,SMALL(IF('quantities report_secondary'!$A$2:$A$10003=F$6,ROW('quantities report_secondary'!$A$2:$A$10003)-1,\"\"),ROWS($B$8:$B20))),\"0\"))","v":""},{"$f":"IF($B20=\"\",\"\",IFERROR(INDEX('quantities report_secondary'!$D$2:$D$10003,SMALL(IF('quantities report_secondary'!$A$2:$A$10003=G$6,ROW('quantities report_secondary'!$A$2:$A$10003)-1,\"\"),ROWS($B$8:$B20))),\"0\"))","v":""},{"$f":"IF($B20=\"\",\"\",IFERROR(INDEX('quantities report_secondary'!$D$2:$D$10003,SMALL(IF('quantities report_secondary'!$A$2:$A$10003=H$6,ROW('quantities report_secondary'!$A$2:$A$10003)-1,\"\"),ROWS($B$8:$B20))),\"0\"))","v":""},{"$f":"IF(B20=\"\",\"\",SUM(C20:H20))","v":""}]
[null,{"$f":"IFERROR(INDEX('manual inputs_secondary'!M:M,SMALL(IF('manual inputs_secondary'!M:M<>\"\",ROW('manual inputs_secondary'!M:M)),ROW(16:16))),\"\")","v":""},{"$f":"IF($B21=\"\",\"\",IFERROR(INDEX('quantities report_secondary'!$D$2:$D$10003,SMALL(IF('quantities report_secondary'!$A$2:$A$10003=C$6,ROW('quantities report_secondary'!$A$2:$A$10003)-1,\"\"),ROWS($B$8:$B21))),\"0\"))","v":""},{"$f":"IF($B21=\"\",\"\",IFERROR(INDEX('quantities report_secondary'!$D$2:$D$10003,SMALL(IF('quantities report_secondary'!$A$2:$A$10003=D$6,ROW('quantities report_secondary'!$A$2:$A$10003)-1,\"\"),ROWS($B$8:$B21))),\"0\"))","v":""},{"$f":"IF($B21=\"\",\"\",IFERROR(INDEX('quantities report_secondary'!$D$2:$D$10003,SMALL(IF('quantities report_secondary'!$A$2:$A$10003=E$6,ROW('quantities report_secondary'!$A$2:$A$10003)-1,\"\"),ROWS($B$8:$B21))),\"0\"))","v":""},{"$f":"IF($B21=\"\",\"\",IFERROR(INDEX('quantities report_secondary'!$D$2:$D$10003,SMALL(IF('quantities report_secondary'!$A$2:$A$10003=F$6,ROW('quantities report_secondary'!$A$2:$A$10003)-1,\"\"),ROWS($B$8:$B21))),\"0\"))","v":""},{"$f":"IF($B21=\"\",\"\",IFERROR(INDEX('quantities report_secondary'!$D$2:$D$10003,SMALL(IF('quantities report_secondary'!$A$2:$A$10003=G$6,ROW('quantities report_secondary'!$A$2:$A$10003)-1,\"\"),ROWS($B$8:$B21))),\"0\"))","v":""},{"$f":"IF($B21=\"\",\"\",IFERROR(INDEX('quantities report_secondary'!$D$2:$D$10003,SMALL(IF('quantities report_secondary'!$A$2:$A$10003=H$6,ROW('quantities report_secondary'!$A$2:$A$10003)-1,\"\"),ROWS($B$8:$B21))),\"0\"))","v":""},{"$f":"IF(B21=\"\",\"\",SUM(C21:H21))","v":""}]
[null,{"$f":"IFERROR(INDEX('manual inputs_secondary'!M:M,SMALL(IF('manual inputs_secondary'!M:M<>\"\",ROW('manual inputs_secondary'!M:M)),ROW(17:17))),\"\")","v":""},{"$f":"IF($B22=\"\",\"\",IFERROR(INDEX('quantities report_secondary'!$D$2:$D$10003,SMALL(IF('quantities report_secondary'!$A$2:$A$10003=C$6,ROW('quantities report_secondary'!$A$2:$A$10003)-1,\"\"),ROWS($B$8:$B22))),\"0\"))","v":""},{"$f":"IF($B22=\"\",\"\",IFERROR(INDEX('quantities report_secondary'!$D$2:$D$10003,SMALL(IF('quantities report_secondary'!$A$2:$A$10003=D$6,ROW('quantities report_secondary'!$A$2:$A$10003)-1,\"\"),ROWS($B$8:$B22))),\"0\"))","v":""},{"$f":"IF($B22=\"\",\"\",IFERROR(INDEX('quantities report_secondary'!$D$2:$D$10003,SMALL(IF('quantities report_secondary'!$A$2:$A$10003=E$6,ROW('quantities report_secondary'!$A$2:$A$10003)-1,\"\"),ROWS($B$8:$B22))),\"0\"))","v":""},{"$f":"IF($B22=\"\",\"\",IFERROR(INDEX('quantities report_secondary'!$D$2:$D$10003,SMALL(IF('quantities report_secondary'!$A$2:$A$10003=F$6,ROW('quantities report_secondary'!$A$2:$A$10003)-1,\"\"),ROWS($B$8:$B22))),\"0\"))","v":""},{"$f":"IF($B22=\"\",\"\",IFERROR(INDEX('quantities report_secondary'!$D$2:$D$10003,SMALL(IF('quantities report_secondary'!$A$2:$A$10003=G$6,ROW('quantities report_secondary'!$A$2:$A$10003)-1,\"\"),ROWS($B$8:$B22))),\"0\"))","v":""},{"$f":"IF($B22=\"\",\"\",IFERROR(INDEX('quantities report_secondary'!$D$2:$D$10003,SMALL(IF('quantities report_secondary'!$A$2:$A$10003=H$6,ROW('quantities report_secondary'!$A$2:$A$10003)-1,\"\"),ROWS($B$8:$B22))),\"0\"))","v":""},{"$f":"IF(B22=\"\",\"\",SUM(C22:H22))","v":""}]
[null,{"$f":"IFERROR(INDEX('manual inputs_secondary'!M:M,SMALL(IF('manual inputs_secondary'!M:M<>\"\",ROW('manual inputs_secondary'!M:M)),ROW(18:18))),\"\")","v":""},{"$f":"IF($B23=\"\",\"\",IFERROR(INDEX('quantities report_secondary'!$D$2:$D$10003,SMALL(IF('quantities report_secondary'!$A$2:$A$10003=C$6,ROW('quantities report_secondary'!$A$2:$A$10003)-1,\"\"),ROWS($B$8:$B23))),\"0\"))","v":""},{"$f":"IF($B23=\"\",\"\",IFERROR(INDEX('quantities report_secondary'!$D$2:$D$10003,SMALL(IF('quantities report_secondary'!$A$2:$A$10003=D$6,ROW('quantities report_secondary'!$A$2:$A$10003)-1,\"\"),ROWS($B$8:$B23))),\"0\"))","v":""},{"$f":"IF($B23=\"\",\"\",IFERROR(INDEX('quantities report_secondary'!$D$2:$D$10003,SMALL(IF('quantities report_secondary'!$A$2:$A$10003=E$6,ROW('quantities report_secondary'!$A$2:$A$10003)-1,\"\"),ROWS($B$8:$B23))),\"0\"))","v":""},{"$f":"IF($B23=\"\",\"\",IFERROR(INDEX('quantities report_secondary'!$D$2:$D$10003,SMALL(IF('quantities report_secondary'!$A$2:$A$10003=F$6,ROW('quantities report_secondary'!$A$2:$A$10003)-1,\"\"),ROWS($B$8:$B23))),\"0\"))","v":""},{"$f":"IF($B23=\"\",\"\",IFERROR(INDEX('quantities report_secondary'!$D$2:$D$10003,SMALL(IF('quantities report_secondary'!$A$2:$A$10003=G$6,ROW('quantities report_secondary'!$A$2:$A$10003)-1,\"\"),ROWS($B$8:$B23))),\"0\"))","v":""},{"$f":"IF($B23=\"\",\"\",IFERROR(INDEX('quantities report_secondary'!$D$2:$D$10003,SMALL(IF('quantities report_secondary'!$A$2:$A$10003=H$6,ROW('quantities report_secondary'!$A$2:$A$10003)-1,\"\"),ROWS($B$8:$B23))),\"0\"))","v":""},{"$f":"IF(B23=\"\",\"\",SUM(C23:H23))","v":""}]
[null,{"$f":"IFERROR(INDEX('manual inputs_secondary'!M:M,SMALL(IF('manual inputs_secondary'!M:M<>\"\",ROW('manual inputs_secondary'!M:M)),ROW(19:19))),\"\")","v":""},{"$f":"IF($B24=\"\",\"\",IFERROR(INDEX('quantities report_secondary'!$D$2:$D$10003,SMALL(IF('quantities report_secondary'!$A$2:$A$10003=C$6,ROW('quantities report_secondary'!$A$2:$A$10003)-1,\"\"),ROWS($B$8:$B24))),\"0\"))","v":""},{"$f":"IF($B24=\"\",\"\",IFERROR(INDEX('quantities report_secondary'!$D$2:$D$10003,SMALL(IF('quantities report_secondary'!$A$2:$A$10003=D$6,ROW('quantities report_secondary'!$A$2:$A$10003)-1,\"\"),ROWS($B$8:$B24))),\"0\"))","v":""},{"$f":"IF($B24=\"\",\"\",IFERROR(INDEX('quantities report_secondary'!$D$2:$D$10003,SMALL(IF('quantities report_secondary'!$A$2:$A$10003=E$6,ROW('quantities report_secondary'!$A$2:$A$10003)-1,\"\"),ROWS($B$8:$B24))),\"0\"))","v":""},{"$f":"IF($B24=\"\",\"\",IFERROR(INDEX('quantities report_secondary'!$D$2:$D$10003,SMALL(IF('quantities report_secondary'!$A$2:$A$10003=F$6,ROW('quantities report_secondary'!$A$2:$A$10003)-1,\"\"),ROWS($B$8:$B24))),\"0\"))","v":""},{"$f":"IF($B24=\"\",\"\",IFERROR(INDEX('quantities report_secondary'!$D$2:$D$10003,SMALL(IF('quantities report_secondary'!$A$2:$A$10003=G$6,ROW('quantities report_secondary'!$A$2:$A$10003)-1,\"\"),ROWS($B$8:$B24))),\"0\"))","v":""},{"$f":"IF($B24=\"\",\"\",IFERROR(INDEX('quantities report_secondary'!$D$2:$D$10003,SMALL(IF('quantities report_secondary'!$A$2:$A$10003=H$6,ROW('quantities report_secondary'!$A$2:$A$10003)-1,\"\"),ROWS($B$8:$B24))),\"0\"))","v":""},{"$f":"IF(B24=\"\",\"\",SUM(C24:H24))","v":""}]
[null,{"$f":"IFERROR(INDEX('manual inputs_secondary'!M:M,SMALL(IF('manual inputs_secondary'!M:M<>\"\",ROW('manual inputs_secondary'!M:M)),ROW(20:20))),\"\")","v":""},{"$f":"IF($B25=\"\",\"\",IFERROR(INDEX('quantities report_secondary'!$D$2:$D$10003,SMALL(IF('quantities report_secondary'!$A$2:$A$10003=C$6,ROW('quantities report_secondary'!$A$2:$A$10003)-1,\"\"),ROWS($B$8:$B25))),\"0\"))","v":""},{"$f":"IF($B25=\"\",\"\",IFERROR(INDEX('quantities report_secondary'!$D$2:$D$10003,SMALL(IF('quantities report_secondary'!$A$2:$A$10003=D$6,ROW('quantities report_secondary'!$A$2:$A$10003)-1,\"\"),ROWS($B$8:$B25))),\"0\"))","v":""},{"$f":"IF($B25=\"\",\"\",IFERROR(INDEX('quantities report_secondary'!$D$2:$D$10003,SMALL(IF('quantities report_secondary'!$A$2:$A$10003=E$6,ROW('quantities report_secondary'!$A$2:$A$10003)-1,\"\"),ROWS($B$8:$B25))),\"0\"))","v":""},{"$f":"IF($B25=\"\",\"\",IFERROR(INDEX('quantities report_secondary'!$D$2:$D$10003,SMALL(IF('quantities report_secondary'!$A$2:$A$10003=F$6,ROW('quantities report_secondary'!$A$2:$A$10003)-1,\"\"),ROWS($B$8:$B25))),\"0\"))","v":""},{"$f":"IF($B25=\"\",\"\",IFERROR(INDEX('quantities report_secondary'!$D$2:$D$10003,SMALL(IF('quantities report_secondary'!$A$2:$A$10003=G$6,ROW('quantities report_secondary'!$A$2:$A$10003)-1,\"\"),ROWS($B$8:$B25))),\"0\"))","v":""},{"$f":"IF($B25=\"\",\"\",IFERROR(INDEX('quantities report_secondary'!$D$2:$D$10003,SMALL(IF('quantities report_secondary'!$A$2:$A$10003=H$6,ROW('quantities report_secondary'!$A$2:$A$10003)-1,\"\"),ROWS($B$8:$B25))),\"0\"))","v":""},{"$f":"IF(B25=\"\",\"\",SUM(C25:H25))","v":""}]
[null,{"$f":"IFERROR(INDEX('manual inputs_secondary'!M:M,SMALL(IF('manual inputs_secondary'!M:M<>\"\",ROW('manual inputs_secondary'!M:M)),ROW(21:21))),\"\")","v":""},{"$f":"IF($B26=\"\",\"\",IFERROR(INDEX('quantities report_secondary'!$D$2:$D$10003,SMALL(IF('quantities report_secondary'!$A$2:$A$10003=C$6,ROW('quantities report_secondary'!$A$2:$A$10003)-1,\"\"),ROWS($B$8:$B26))),\"0\"))","v":""},{"$f":"IF($B26=\"\",\"\",IFERROR(INDEX('quantities report_secondary'!$D$2:$D$10003,SMALL(IF('quantities report_secondary'!$A$2:$A$10003=D$6,ROW('quantities report_secondary'!$A$2:$A$10003)-1,\"\"),ROWS($B$8:$B26))),\"0\"))","v":""},{"$f":"IF($B26=\"\",\"\",IFERROR(INDEX('quantities report_secondary'!$D$2:$D$10003,SMALL(IF('quantities report_secondary'!$A$2:$A$10003=E$6,ROW('quantities report_secondary'!$A$2:$A$10003)-1,\"\"),ROWS($B$8:$B26))),\"0\"))","v":""},{"$f":"IF($B26=\"\",\"\",IFERROR(INDEX('quantities report_secondary'!$D$2:$D$10003,SMALL(IF('quantities report_secondary'!$A$2:$A$10003=F$6,ROW('quantities report_secondary'!$A$2:$A$10003)-1,\"\"),ROWS($B$8:$B26))),\"0\"))","v":""},{"$f":"IF($B26=\"\",\"\",IFERROR(INDEX('quantities report_secondary'!$D$2:$D$10003,SMALL(IF('quantities report_secondary'!$A$2:$A$10003=G$6,ROW('quantities report_secondary'!$A$2:$A$10003)-1,\"\"),ROWS($B$8:$B26))),\"0\"))","v":""},{"$f":"IF($B26=\"\",\"\",IFERROR(INDEX('quantities report_secondary'!$D$2:$D$10003,SMALL(IF('quantities report_secondary'!$A$2:$A$10003=H$6,ROW('quantities report_secondary'!$A$2:$A$10003)-1,\"\"),ROWS($B$8:$B26))),\"0\"))","v":""},{"$f":"IF(B26=\"\",\"\",SUM(C26:H26))","v":""}]
[null,{"$f":"IFERROR(INDEX('manual inputs_secondary'!M:M,SMALL(IF('manual inputs_secondary'!M:M<>\"\",ROW('manual inputs_secondary'!M:M)),ROW(22:22))),\"\")","v":""},{"$f":"IF($B27=\"\",\"\",IFERROR(INDEX('quantities report_secondary'!$D$2:$D$10003,SMALL(IF('quantities report_secondary'!$A$2:$A$10003=C$6,ROW('quantities report_secondary'!$A$2:$A$10003)-1,\"\"),ROWS($B$8:$B27))),\"0\"))","v":""},{"$f":"IF($B27=\"\",\"\",IFERROR(INDEX('quantities report_secondary'!$D$2:$D$10003,SMALL(IF('quantities report_secondary'!$A$2:$A$10003=D$6,ROW('quantities report_secondary'!$A$2:$A$10003)-1,\"\"),ROWS($B$8:$B27))),\"0\"))","v":""},{"$f":"IF($B27=\"\",\"\",IFERROR(INDEX('quantities report_secondary'!$D$2:$D$10003,SMALL(IF('quantities report_secondary'!$A$2:$A$10003=E$6,ROW('quantities report_secondary'!$A$2:$A$10003)-1,\"\"),ROWS($B$8:$B27))),\"0\"))","v":""},{"$f":"IF($B27=\"\",\"\",IFERROR(INDEX('quantities report_secondary'!$D$2:$D$10003,SMALL(IF('quantities report_secondary'!$A$2:$A$10003=F$6,ROW('quantities report_secondary'!$A$2:$A$10003)-1,\"\"),ROWS($B$8:$B27))),\"0\"))","v":""},{"$f":"IF($B27=\"\",\"\",IFERROR(INDEX('quantities report_secondary'!$D$2:$D$10003,SMALL(IF('quantities report_secondary'!$A$2:$A$10003=G$6,ROW('quantities report_secondary'!$A$2:$A$10003)-1,\"\"),ROWS($B$8:$B27))),\"0\"))","v":""},{"$f":"IF($B27=\"\",\"\",IFERROR(INDEX('quantities report_secondary'!$D$2:$D$10003,SMALL(IF('quantities report_secondary'!$A$2:$A$10003=H$6,ROW('quantities report_secondary'!$A$2:$A$10003)-1,\"\"),ROWS($B$8:$B27))),\"0\"))","v":""},{"$f":"IF(B27=\"\",\"\",SUM(C27:H27))","v":""}]
[null,{"$f":"IFERROR(INDEX('manual inputs_secondary'!M:M,SMALL(IF('manual inputs_secondary'!M:M<>\"\",ROW('manual inputs_secondary'!M:M)),ROW(23:23))),\"\")","v":""},{"$f":"IF($B28=\"\",\"\",IFERROR(INDEX('quantities report_secondary'!$D$2:$D$10003,SMALL(IF('quantities report_secondary'!$A$2:$A$10003=C$6,ROW('quantities report_secondary'!$A$2:$A$10003)-1,\"\"),ROWS($B$8:$B28))),\"0\"))","v":""},{"$f":"IF($B28=\"\",\"\",IFERROR(INDEX('quantities report_secondary'!$D$2:$D$10003,SMALL(IF('quantities report_secondary'!$A$2:$A$10003=D$6,ROW('quantities report_secondary'!$A$2:$A$10003)-1,\"\"),ROWS($B$8:$B28))),\"0\"))","v":""},{"$f":"IF($B28=\"\",\"\",IFERROR(INDEX('quantities report_secondary'!$D$2:$D$10003,SMALL(IF('quantities report_secondary'!$A$2:$A$10003=E$6,ROW('quantities report_secondary'!$A$2:$A$10003)-1,\"\"),ROWS($B$8:$B28))),\"0\"))","v":""},{"$f":"IF($B28=\"\",\"\",IFERROR(INDEX('quantities report_secondary'!$D$2:$D$10003,SMALL(IF('quantities report_secondary'!$A$2:$A$10003=F$6,ROW('quantities report_secondary'!$A$2:$A$10003)-1,\"\"),ROWS($B$8:$B28))),\"0\"))","v":""},{"$f":"IF($B28=\"\",\"\",IFERROR(INDEX('quantities report_secondary'!$D$2:$D$10003,SMALL(IF('quantities report_secondary'!$A$2:$A$10003=G$6,ROW('quantities report_secondary'!$A$2:$A$10003)-1,\"\"),ROWS($B$8:$B28))),\"0\"))","v":""},{"$f":"IF($B28=\"\",\"\",IFERROR(INDEX('quantities report_secondary'!$D$2:$D$10003,SMALL(IF('quantities report_secondary'!$A$2:$A$10003=H$6,ROW('quantities report_secondary'!$A$2:$A$10003)-1,\"\"),ROWS($B$8:$B28))),\"0\"))","v":""},{"$f":"IF(B28=\"\",\"\",SUM(C28:H28))","v":""}]
[null,{"$f":"IFERROR(INDEX('manual inputs_secondary'!M:M,SMALL(IF('manual inputs_secondary'!M:M<>\"\",ROW('manual inputs_secondary'!M:M)),ROW(24:24))),\"\")","v":""},{"$f":"IF($B29=\"\",\"\",IFERROR(INDEX('quantities report_secondary'!$D$2:$D$10003,SMALL(IF('quantities report_secondary'!$A$2:$A$10003=C$6,ROW('quantities report_secondary'!$A$2:$A$10003)-1,\"\"),ROWS($B$8:$B29))),\"0\"))","v":""},{"$f":"IF($B29=\"\",\"\",IFERROR(INDEX('quantities report_secondary'!$D$2:$D$10003,SMALL(IF('quantities report_secondary'!$A$2:$A$10003=D$6,ROW('quantities report_secondary'!$A$2:$A$10003)-1,\"\"),ROWS($B$8:$B29))),\"0\"))","v":""},{"$f":"IF($B29=\"\",\"\",IFERROR(INDEX('quantities report_secondary'!$D$2:$D$10003,SMALL(IF('quantities report_secondary'!$A$2:$A$10003=E$6,ROW('quantities report_secondary'!$A$2:$A$10003)-1,\"\"),ROWS($B$8:$B29))),\"0\"))","v":""},{"$f":"IF($B29=\"\",\"\",IFERROR(INDEX('quantities report_secondary'!$D$2:$D$10003,SMALL(IF('quantities report_secondary'!$A$2:$A$10003=F$6,ROW('quantities report_secondary'!$A$2:$A$10003)-1,\"\"),ROWS($B$8:$B29))),\"0\"))","v":""},{"$f":"IF($B29=\"\",\"\",IFERROR(INDEX('quantities report_secondary'!$D$2:$D$10003,SMALL(IF('quantities report_secondary'!$A$2:$A$10003=G$6,ROW('quantities report_secondary'!$A$2:$A$10003)-1,\"\"),ROWS($B$8:$B29))),\"0\"))","v":""},{"$f":"IF($B29=\"\",\"\",IFERROR(INDEX('quantities report_secondary'!$D$2:$D$10003,SMALL(IF('quantities report_secondary'!$A$2:$A$10003=H$6,ROW('quantities report_secondary'!$A$2:$A$10003)-1,\"\"),ROWS($B$8:$B29))),\"0\"))","v":""},{"$f":"IF(B29=\"\",\"\",SUM(C29:H29))","v":""}]
[null,{"$f":"IFERROR(INDEX('manual inputs_secondary'!M:M,SMALL(IF('manual inputs_secondary'!M:M<>\"\",ROW('manual inputs_secondary'!M:M)),ROW(25:25))),\"\")","v":""},{"$f":"IF($B30=\"\",\"\",IFERROR(INDEX('quantities report_secondary'!$D$2:$D$10003,SMALL(IF('quantities report_secondary'!$A$2:$A$10003=C$6,ROW('quantities report_secondary'!$A$2:$A$10003)-1,\"\"),ROWS($B$8:$B30))),\"0\"))","v":""},{"$f":"IF($B30=\"\",\"\",IFERROR(INDEX('quantities report_secondary'!$D$2:$D$10003,SMALL(IF('quantities report_secondary'!$A$2:$A$10003=D$6,ROW('quantities report_secondary'!$A$2:$A$10003)-1,\"\"),ROWS($B$8:$B30))),\"0\"))","v":""},{"$f":"IF($B30=\"\",\"\",IFERROR(INDEX('quantities report_secondary'!$D$2:$D$10003,SMALL(IF('quantities report_secondary'!$A$2:$A$10003=E$6,ROW('quantities report_secondary'!$A$2:$A$10003)-1,\"\"),ROWS($B$8:$B30))),\"0\"))","v":""},{"$f":"IF($B30=\"\",\"\",IFERROR(INDEX('quantities report_secondary'!$D$2:$D$10003,SMALL(IF('quantities report_secondary'!$A$2:$A$10003=F$6,ROW('quantities report_secondary'!$A$2:$A$10003)-1,\"\"),ROWS($B$8:$B30))),\"0\"))","v":""},{"$f":"IF($B30=\"\",\"\",IFERROR(INDEX('quantities report_secondary'!$D$2:$D$10003,SMALL(IF('quantities report_secondary'!$A$2:$A$10003=G$6,ROW('quantities report_secondary'!$A$2:$A$10003)-1,\"\"),ROWS($B$8:$B30))),\"0\"))","v":""},{"$f":"IF($B30=\"\",\"\",IFERROR(INDEX('quantities report_secondary'!$D$2:$D$10003,SMALL(IF('quantities report_secondary'!$A$2:$A$10003=H$6,ROW('quantities report_secondary'!$A$2:$A$10003)-1,\"\"),ROWS($B$8:$B30))),\"0\"))","v":""},{"$f":"IF(B30=\"\",\"\",SUM(C30:H30))","v":""}]
[null,{"$f":"IFERROR(INDEX('manual inputs_secondary'!M:M,SMALL(IF('manual inputs_secondary'!M:M<>\"\",ROW('manual inputs_secondary'!M:M)),ROW(26:26))),\"\")","v":""},{"$f":"IF($B31=\"\",\"\",IFERROR(INDEX('quantities report_secondary'!$D$2:$D$10003,SMALL(IF('quantities report_secondary'!$A$2:$A$10003=C$6,ROW('quantities report_secondary'!$A$2:$A$10003)-1,\"\"),ROWS($B$8:$B31))),\"0\"))","v":""},{"$f":"IF($B31=\"\",\"\",IFERROR(INDEX('quantities report_secondary'!$D$2:$D$10003,SMALL(IF('quantities report_secondary'!$A$2:$A$10003=D$6,ROW('quantities report_secondary'!$A$2:$A$10003)-1,\"\"),ROWS($B$8:$B31))),\"0\"))","v":""},{"$f":"IF($B31=\"\",\"\",IFERROR(INDEX('quantities report_secondary'!$D$2:$D$10003,SMALL(IF('quantities report_secondary'!$A$2:$A$10003=E$6,ROW('quantities report_secondary'!$A$2:$A$10003)-1,\"\"),ROWS($B$8:$B31))),\"0\"))","v":""},{"$f":"IF($B31=\"\",\"\",IFERROR(INDEX('quantities report_secondary'!$D$2:$D$10003,SMALL(IF('quantities report_secondary'!$A$2:$A$10003=F$6,ROW('quantities report_secondary'!$A$2:$A$10003)-1,\"\"),ROWS($B$8:$B31))),\"0\"))","v":""},{"$f":"IF($B31=\"\",\"\",IFERROR(INDEX('quantities report_secondary'!$D$2:$D$10003,SMALL(IF('quantities report_secondary'!$A$2:$A$10003=G$6,ROW('quantities report_secondary'!$A$2:$A$10003)-1,\"\"),ROWS($B$8:$B31))),\"0\"))","v":""},{"$f":"IF($B31=\"\",\"\",IFERROR(INDEX('quantities report_secondary'!$D$2:$D$10003,SMALL(IF('quantities report_secondary'!$A$2:$A$10003=H$6,ROW('quantities report_secondary'!$A$2:$A$10003)-1,\"\"),ROWS($B$8:$B31))),\"0\"))","v":""},{"$f":"IF(B31=\"\",\"\",SUM(C31:H31))","v":""}]
[null,{"$f":"IFERROR(INDEX(#REF!,SMALL(IF(#REF!<>\"\",ROW(#REF!)),ROW(27:27))),\"\")","v":""}]

{"sheet":"Backfill_Secondary","index":19,"n_rows":32,"n_cols":17,"rows_kept":32,"cut":false,"hidden":false,"merged":[[3,2,3,16],[4,4,5,4],[4,7,5,7],[4,15,5,15]]}
[]
[]
["TOTALS",null,{"$f":"SUM(C8:C32)","v":0},{"$f":"SUM(D8:D32)","v":0},null,0,{"$f":"SUM(G8:G32)","v":0},null,0,0,0,0,{"$f":"SUM(M8:M32)","v":0},0,0,null,0]
[null,null,"Various Backfill Material Generated Onsite"]
[null,null,"(+)\nWall Backfill","(+)\nWall Backfill","Total Wall Backfill (+)","(+)\nFoundation\nFill","(+)\nFoundation\nFill","Total Foundation Fill (+)","(+)\nSelect Wall\nBackfill","(+)\nRock","(+)\nGranular\nRock Backdrain","(+)\nStructural Backfill","(+)\nBackfill\nMaterial","(+)\nBackfill\nMaterial","(+)\nBackfill\nMaterial","Total Backfill Material (+)","(+)\nGranular\nBackfill"]
["ORD Component Name",null,"XS_TC_MSE Wall Backfill 1: ","Need Parapet backfill",null,"XS_TC_Wall Foundation: ","XS_TC_MSE Wall Foundation: ",null,"XS_TC_MSE Wall Backfill 2: ","XS_TC_Rockery Wall Back: ","Need Rockery Component","XS_TC_Wall Backfill: ","XS_TC_Soil Nail Wall Backfill: ","XS_TC_Wall Backfill 2: ","XS_TC_Guard Wall Backfill 1: ",null,"Need gabion faced MSE component"]
["Enter Start of Project",{"$f":"IFERROR(INDEX('manual inputs_secondary'!M:M,SMALL(IF('manual inputs_secondary'!M:M<>\"\",ROW('manual inputs_secondary'!M:M)),ROW(2:2))),\"\")","v":""}]
[null,{"$f":"IFERROR(INDEX('manual inputs_secondary'!M:M,SMALL(IF('manual inputs_secondary'!M:M<>\"\",ROW('manual inputs_secondary'!M:M)),ROW(3:3))),\"\")","v":""},{"$f":"IF($B8=\"\",\"\",IFERROR(INDEX('quantities report_secondary'!$D$2:$D$10003,SMALL(IF('quantities report_secondary'!$A$2:$A$10003=C$6,ROW('quantities report_secondary'!$A$2:$A$10003)-1,\"\"),ROWS($B$8:$B8))),\"0\"))","v":""},{"$f":"IF($B8=\"\",\"\",IFERROR(INDEX('quantities report_secondary'!$D$2:$D$10003,SMALL(IF('quantities report_secondary'!$A$2:$A$10003=D$6,ROW('quantities report_secondary'!$A$2:$A$10003)-1,\"\"),ROWS($B$8:$B8))),\"0\"))","v":""},{"$f":"IF($B8=\"\",\"\",SUM(C8:D8))","v":""},{"$f":"IF($B8=\"\",\"\",IFERROR(INDEX('quantities report_secondary'!$D$2:$D$10003,SMALL(IF('quantities report_secondary'!$A$2:$A$10003=F$6,ROW('quantities report_secondary'!$A$2:$A$10003)-1,\"\"),ROWS($B$8:$B8))),\"0\"))","v":""},{"$f":"IF($B8=\"\",\"\",IFERROR(INDEX('quantities report_secondary'!$D$2:$D$10003,SMALL(IF('quantities report_secondary'!$A$2:$A$10003=G$6,ROW('quantities report_secondary'!$A$2:$A$10003)-1,\"\"),ROWS($B$8:$B8))),\"0\"))","v":""},{"$f":"IF($B8=\"\",\"\",SUM(F8:G8))","v":""},{"$f":"IF($B8=\"\",\"\",IFERROR(INDEX('quantities report_secondary'!$D$2:$D$10003,SMALL(IF('quantities report_secondary'!$A$2:$A$10003=I$6,ROW('quantities report_secondary'!$A$2:$A$10003)-1,\"\"),ROWS($B$8:$B8))),\"0\"))","v":""},{"$f":"IF($B8=\"\",\"\",IFERROR(INDEX('quantities report_secondary'!$D$2:$D$10003,SMALL(IF('quantities report_secondary'!$A$2:$A$10003=J$6,ROW('quantities report_secondary'!$A$2:$A$10003)-1,\"\"),ROWS($B$8:$B8))),\"0\"))","v":""},{"$f":"IF($B8=\"\",\"\",IFERROR(INDEX('quantities report_secondary'!$D$2:$D$10003,SMALL(IF('quantities report_secondary'!$A$2:$A$10003=K$6,ROW('quantities report_secondary'!$A$2:$A$10003)-1,\"\"),ROWS($B$8:$B8))),\"0\"))","v":""},{"$f":"IF($B8=\"\",\"\",IFERROR(INDEX('quantities report_secondary'!$D$2:$D$10003,SMALL(IF('quantities report_secondary'!$A$2:$A$10003=L$6,ROW('quantities report_secondary'!$A$2:$A$10003)-1,\"\"),ROWS($B$8:$B8))),\"0\"))","v":""},{"$f":"IF($B8=\"\",\"\",IFERROR(INDEX('quantities report_secondary'!$D$2:$D$10003,SMALL(IF('quantities report_secondary'!$A$2:$A$10003=M$6,ROW('quantities report_secondary'!$A$2:$A$10003)-1,\"\"),ROWS($B$8:$B8))),\"0\"))","v":""},{"$f":"IF($B8=\"\",\"\",IFERROR(INDEX('quantities report_secondary'!$D$2:$D$10003,SMALL(IF('quantities report_secondary'!$A$2:$A$10003=N$6,ROW('quantities report_secondary'!$A$2:$A$10003)-1,\"\"),ROWS($B$8:$B8))),\"0\"))","v":""},{"$f":"IF($B8=\"\",\"\",IFERROR(INDEX('quantities report_secondary'!$D$2:$D$10003,SMALL(IF('quantities report_secondary'!$A$2:$A$10003=O$6,ROW('quantities report_secondary'!$A$2:$A$10003)-1,\"\"),ROWS($B$8:$B8))),\"0\"))","v":""},{"$f":"IF($B8=\"\",\"\",SUM(M8:O8))","v":""},{"$f":"IF($B8=\"\",\"\",IFERROR(INDEX('quantities report_secondary'!$D$2:$D$10003,SMALL(IF('quantities report_secondary'!$A$2:$A$10003=Q$6,ROW('quantities report_secondary'!$A$2:$A$10003)-1,\"\"),ROWS($B$8:$B8))),\"0\"))","v":""}]
[null,{"$f":"IFERROR(INDEX('manual inputs_secondary'!M:M,SMALL(IF('manual inputs_secondary'!M:M<>\"\",ROW('manual inputs_secondary'!M:M)),ROW(4:4))),\"\")","v":""},{"$f":"IF($B9=\"\",\"\",IFERROR(INDEX('quantities report_secondary'!$D$2:$D$10003,SMALL(IF('quantities report_secondary'!$A$2:$A$10003=C$6,ROW('quantities report_secondary'!$A$2:$A$10003)-1,\"\"),ROWS($B$8:$B9))),\"0\"))","v":""},{"$f":"IF($B9=\"\",\"\",IFERROR(INDEX('quantities report_secondary'!$D$2:$D$10003,SMALL(IF('quantities report_secondary'!$A$2:$A$10003=D$6,ROW('quantities report_secondary'!$A$2:$A$10003)-1,\"\"),ROWS($B$8:$B9))),\"0\"))","v":""},{"$f":"IF($B9=\"\",\"\",SUM(C9:D9))","v":""},{"$f":"IF($B9=\"\",\"\",IFERROR(INDEX('quantities report_secondary'!$D$2:$D$10003,SMALL(IF('quantities report_secondary'!$A$2:$A$10003=F$6,ROW('quantities report_secondary'!$A$2:$A$10003)-1,\"\"),ROWS($B$8:$B9))),\"0\"))","v":""},{"$f":"IF($B9=\"\",\"\",IFERROR(INDEX('quantities report_secondary'!$D$2:$D$10003,SMALL(IF('quantities report_secondary'!$A$2:$A$10003=G$6,ROW('quantities report_secondary'!$A$2:$A$10003)-1,\"\"),ROWS($B$8:$B9))),\"0\"))","v":""},{"$f":"IF($B9=\"\",\"\",SUM(F9:G9))","v":""},{"$f":"IF($B9=\"\",\"\",IFERROR(INDEX('quantities report_secondary'!$D$2:$D$10003,SMALL(IF('quantities report_secondary'!$A$2:$A$10003=I$6,ROW('quantities report_secondary'!$A$2:$A$10003)-1,\"\"),ROWS($B$8:$B9))),\"0\"))","v":""},{"$f":"IF($B9=\"\",\"\",IFERROR(INDEX('quantities report_secondary'!$D$2:$D$10003,SMALL(IF('quantities report_secondary'!$A$2:$A$10003=J$6,ROW('quantities report_secondary'!$A$2:$A$10003)-1,\"\"),ROWS($B$8:$B9))),\"0\"))","v":""},{"$f":"IF($B9=\"\",\"\",IFERROR(INDEX('quantities report_secondary'!$D$2:$D$10003,SMALL(IF('quantities report_secondary'!$A$2:$A$10003=K$6,ROW('quantities report_secondary'!$A$2:$A$10003)-1,\"\"),ROWS($B$8:$B9))),\"0\"))","v":""},{"$f":"IF($B9=\"\",\"\",IFERROR(INDEX('quantities report_secondary'!$D$2:$D$10003,SMALL(IF('quantities report_secondary'!$A$2:$A$10003=L$6,ROW('quantities report_secondary'!$A$2:$A$10003)-1,\"\"),ROWS($B$8:$B9))),\"0\"))","v":""},{"$f":"IF($B9=\"\",\"\",IFERROR(INDEX('quantities report_secondary'!$D$2:$D$10003,SMALL(IF('quantities report_secondary'!$A$2:$A$10003=M$6,ROW('quantities report_secondary'!$A$2:$A$10003)-1,\"\"),ROWS($B$8:$B9))),\"0\"))","v":""},{"$f":"IF($B9=\"\",\"\",IFERROR(INDEX('quantities report_secondary'!$D$2:$D$10003,SMALL(IF('quantities report_secondary'!$A$2:$A$10003=N$6,ROW('quantities report_secondary'!$A$2:$A$10003)-1,\"\"),ROWS($B$8:$B9))),\"0\"))","v":""},{"$f":"IF($B9=\"\",\"\",IFERROR(INDEX('quantities report_secondary'!$D$2:$D$10003,SMALL(IF('quantities report_secondary'!$A$2:$A$10003=O$6,ROW('quantities report_secondary'!$A$2:$A$10003)-1,\"\"),ROWS($B$8:$B9))),\"0\"))","v":""},{"$f":"IF($B9=\"\",\"\",SUM(M9:O9))","v":""},{"$f":"IF($B9=\"\",\"\",IFERROR(INDEX('quantities report_secondary'!$D$2:$D$10003,SMALL(IF('quantities report_secondary'!$A$2:$A$10003=Q$6,ROW('quantities report_secondary'!$A$2:$A$10003)-1,\"\"),ROWS($B$8:$B9))),\"0\"))","v":""}]
[null,{"$f":"IFERROR(INDEX('manual inputs_secondary'!M:M,SMALL(IF('manual inputs_secondary'!M:M<>\"\",ROW('manual inputs_secondary'!M:M)),ROW(5:5))),\"\")","v":""},{"$f":"IF($B10=\"\",\"\",IFERROR(INDEX('quantities report_secondary'!$D$2:$D$10003,SMALL(IF('quantities report_secondary'!$A$2:$A$10003=C$6,ROW('quantities report_secondary'!$A$2:$A$10003)-1,\"\"),ROWS($B$8:$B10))),\"0\"))","v":""},{"$f":"IF($B10=\"\",\"\",IFERROR(INDEX('quantities report_secondary'!$D$2:$D$10003,SMALL(IF('quantities report_secondary'!$A$2:$A$10003=D$6,ROW('quantities report_secondary'!$A$2:$A$10003)-1,\"\"),ROWS($B$8:$B10))),\"0\"))","v":""},"",{"$f":"IF($B10=\"\",\"\",IFERROR(INDEX('quantities report_secondary'!$D$2:$D$10003,SMALL(IF('quantities report_secondary'!$A$2:$A$10003=F$6,ROW('quantities report_secondary'!$A$2:$A$10003)-1,\"\"),ROWS($B$8:$B10))),\"0\"))","v":""},{"$f":"IF($B10=\"\",\"\",IFERROR(INDEX('quantities report_secondary'!$D$2:$D$10003,SMALL(IF('quantities report_secondary'!$A$2:$A$10003=G$6,ROW('quantities report_secondary'!$A$2:$A$10003)-1,\"\"),ROWS($B$8:$B10))),\"0\"))","v":""},"",{"$f":"IF($B10=\"\",\"\",IFERROR(INDEX('quantities report_secondary'!$D$2:$D$10003,SMALL(IF('quantities report_secondary'!$A$2:$A$10003=I$6,ROW('quantities report_secondary'!$A$2:$A$10003)-1,\"\"),ROWS($B$8:$B10))),\"0\"))","v":""},{"$f":"IF($B10=\"\",\"\",IFERROR(INDEX('quantities report_secondary'!$D$2:$D$10003,SMALL(IF('quantities report_secondary'!$A$2:$A$10003=J$6,ROW('quantities report_secondary'!$A$2:$A$10003)-1,\"\"),ROWS($B$8:$B10))),\"0\"))","v":""},{"$f":"IF($B10=\"\",\"\",IFERROR(INDEX('quantities report_secondary'!$D$2:$D$10003,SMALL(IF('quantities report_secondary'!$A$2:$A$10003=K$6,ROW('quantities report_secondary'!$A$2:$A$10003)-1,\"\"),ROWS($B$8:$B10))),\"0\"))","v":""},{"$f":"IF($B10=\"\",\"\",IFERROR(INDEX('quantities report_secondary'!$D$2:$D$10003,SMALL(IF('quantities report_secondary'!$A$2:$A$10003=L$6,ROW('quantities report_secondary'!$A$2:$A$10003)-1,\"\"),ROWS($B$8:$B10))),\"0\"))","v":""},{"$f":"IF($B10=\"\",\"\",IFERROR(INDEX('quantities report_secondary'!$D$2:$D$10003,SMALL(IF('quantities report_secondary'!$A$2:$A$10003=M$6,ROW('quantities report_secondary'!$A$2:$A$10003)-1,\"\"),ROWS($B$8:$B10))),\"0\"))","v":""},{"$f":"IF($B10=\"\",\"\",IFERROR(INDEX('quantities report_secondary'!$D$2:$D$10003,SMALL(IF('quantities report_secondary'!$A$2:$A$10003=N$6,ROW('quantities report_secondary'!$A$2:$A$10003)-1,\"\"),ROWS($B$8:$B10))),\"0\"))","v":""},{"$f":"IF($B10=\"\",\"\",IFERROR(INDEX('quantities report_secondary'!$D$2:$D$10003,SMALL(IF('quantities report_secondary'!$A$2:$A$10003=O$6,ROW('quantities report_secondary'!$A$2:$A$10003)-1,\"\"),ROWS($B$8:$B10))),\"0\"))","v":""},"",{"$f":"IF($B10=\"\",\"\",IFERROR(INDEX('quantities report_secondary'!$D$2:$D$10003,SMALL(IF('quantities report_secondary'!$A$2:$A$10003=Q$6,ROW('quantities report_secondary'!$A$2:$A$10003)-1,\"\"),ROWS($B$8:$B10))),\"0\"))","v":""}]
[null,{"$f":"IFERROR(INDEX('manual inputs_secondary'!M:M,SMALL(IF('manual inputs_secondary'!M:M<>\"\",ROW('manual inputs_secondary'!M:M)),ROW(6:6))),\"\")","v":""},{"$f":"IF($B11=\"\",\"\",IFERROR(INDEX('quantities report_secondary'!$D$2:$D$10003,SMALL(IF('quantities report_secondary'!$A$2:$A$10003=C$6,ROW('quantities report_secondary'!$A$2:$A$10003)-1,\"\"),ROWS($B$8:$B11))),\"0\"))","v":""},{"$f":"IF($B11=\"\",\"\",IFERROR(INDEX('quantities report_secondary'!$D$2:$D$10003,SMALL(IF('quantities report_secondary'!$A$2:$A$10003=D$6,ROW('quantities report_secondary'!$A$2:$A$10003)-1,\"\"),ROWS($B$8:$B11))),\"0\"))","v":""},"",{"$f":"IF($B11=\"\",\"\",IFERROR(INDEX('quantities report_secondary'!$D$2:$D$10003,SMALL(IF('quantities report_secondary'!$A$2:$A$10003=F$6,ROW('quantities report_secondary'!$A$2:$A$10003)-1,\"\"),ROWS($B$8:$B11))),\"0\"))","v":""},{"$f":"IF($B11=\"\",\"\",IFERROR(INDEX('quantities report_secondary'!$D$2:$D$10003,SMALL(IF('quantities report_secondary'!$A$2:$A$10003=G$6,ROW('quantities report_secondary'!$A$2:$A$10003)-1,\"\"),ROWS($B$8:$B11))),\"0\"))","v":""},"",{"$f":"IF($B11=\"\",\"\",IFERROR(INDEX('quantities report_secondary'!$D$2:$D$10003,SMALL(IF('quantities report_secondary'!$A$2:$A$10003=I$6,ROW('quantities report_secondary'!$A$2:$A$10003)-1,\"\"),ROWS($B$8:$B11))),\"0\"))","v":""},{"$f":"IF($B11=\"\",\"\",IFERROR(INDEX('quantities report_secondary'!$D$2:$D$10003,SMALL(IF('quantities report_secondary'!$A$2:$A$10003=J$6,ROW('quantities report_secondary'!$A$2:$A$10003)-1,\"\"),ROWS($B$8:$B11))),\"0\"))","v":""},{"$f":"IF($B11=\"\",\"\",IFERROR(INDEX('quantities report_secondary'!$D$2:$D$10003,SMALL(IF('quantities report_secondary'!$A$2:$A$10003=K$6,ROW('quantities report_secondary'!$A$2:$A$10003)-1,\"\"),ROWS($B$8:$B11))),\"0\"))","v":""},{"$f":"IF($B11=\"\",\"\",IFERROR(INDEX('quantities report_secondary'!$D$2:$D$10003,SMALL(IF('quantities report_secondary'!$A$2:$A$10003=L$6,ROW('quantities report_secondary'!$A$2:$A$10003)-1,\"\"),ROWS($B$8:$B11))),\"0\"))","v":""},{"$f":"IF($B11=\"\",\"\",IFERROR(INDEX('quantities report_secondary'!$D$2:$D$10003,SMALL(IF('quantities report_secondary'!$A$2:$A$10003=M$6,ROW('quantities report_secondary'!$A$2:$A$10003)-1,\"\"),ROWS($B$8:$B11))),\"0\"))","v":""},{"$f":"IF($B11=\"\",\"\",IFERROR(INDEX('quantities report_secondary'!$D$2:$D$10003,SMALL(IF('quantities report_secondary'!$A$2:$A$10003=N$6,ROW('quantities report_secondary'!$A$2:$A$10003)-1,\"\"),ROWS($B$8:$B11))),\"0\"))","v":""},{"$f":"IF($B11=\"\",\"\",IFERROR(INDEX('quantities report_secondary'!$D$2:$D$10003,SMALL(IF('quantities report_secondary'!$A$2:$A$10003=O$6,ROW('quantities report_secondary'!$A$2:$A$10003)-1,\"\"),ROWS($B$8:$B11))),\"0\"))","v":""},"",{"$f":"IF($B11=\"\",\"\",IFERROR(INDEX('quantities report_secondary'!$D$2:$D$10003,SMALL(IF('quantities report_secondary'!$A$2:$A$10003=Q$6,ROW('quantities report_secondary'!$A$2:$A$10003)-1,\"\"),ROWS($B$8:$B11))),\"0\"))","v":""}]
[null,{"$f":"IFERROR(INDEX('manual inputs_secondary'!M:M,SMALL(IF('manual inputs_secondary'!M:M<>\"\",ROW('manual inputs_secondary'!M:M)),ROW(7:7))),\"\")","v":""},{"$f":"IF($B12=\"\",\"\",IFERROR(INDEX('quantities report_secondary'!$D$2:$D$10003,SMALL(IF('quantities report_secondary'!$A$2:$A$10003=C$6,ROW('quantities report_secondary'!$A$2:$A$10003)-1,\"\"),ROWS($B$8:$B12))),\"0\"))","v":""},{"$f":"IF($B12=\"\",\"\",IFERROR(INDEX('quantities report_secondary'!$D$2:$D$10003,SMALL(IF('quantities report_secondary'!$A$2:$A$10003=D$6,ROW('quantities report_secondary'!$A$2:$A$10003)-1,\"\"),ROWS($B$8:$B12))),\"0\"))","v":""},"",{"$f":"IF($B12=\"\",\"\",IFERROR(INDEX('quantities report_secondary'!$D$2:$D$10003,SMALL(IF('quantities report_secondary'!$A$2:$A$10003=F$6,ROW('quantities report_secondary'!$A$2:$A$10003)-1,\"\"),ROWS($B$8:$B12))),\"0\"))","v":""},{"$f":"IF($B12=\"\",\"\",IFERROR(INDEX('quantities report_secondary'!$D$2:$D$10003,SMALL(IF('quantities report_secondary'!$A$2:$A$10003=G$6,ROW('quantities report_secondary'!$A$2:$A$10003)-1,\"\"),ROWS($B$8:$B12))),\"0\"))","v":""},"",{"$f":"IF($B12=\"\",\"\",IFERROR(INDEX('quantities report_secondary'!$D$2:$D$10003,SMALL(IF('quantities report_secondary'!$A$2:$A$10003=I$6,ROW('quantities report_secondary'!$A$2:$A$10003)-1,\"\"),ROWS($B$8:$B12))),\"0\"))","v":""},{"$f":"IF($B12=\"\",\"\",IFERROR(INDEX('quantities report_secondary'!$D$2:$D$10003,SMALL(IF('quantities report_secondary'!$A$2:$A$10003=J$6,ROW('quantities report_secondary'!$A$2:$A$10003)-1,\"\"),ROWS($B$8:$B12))),\"0\"))","v":""},{"$f":"IF($B12=\"\",\"\",IFERROR(INDEX('quantities report_secondary'!$D$2:$D$10003,SMALL(IF('quantities report_secondary'!$A$2:$A$10003=K$6,ROW('quantities report_secondary'!$A$2:$A$10003)-1,\"\"),ROWS($B$8:$B12))),\"0\"))","v":""},{"$f":"IF($B12=\"\",\"\",IFERROR(INDEX('quantities report_secondary'!$D$2:$D$10003,SMALL(IF('quantities report_secondary'!$A$2:$A$10003=L$6,ROW('quantities report_secondary'!$A$2:$A$10003)-1,\"\"),ROWS($B$8:$B12))),\"0\"))","v":""},{"$f":"IF($B12=\"\",\"\",IFERROR(INDEX('quantities report_secondary'!$D$2:$D$10003,SMALL(IF('quantities report_secondary'!$A$2:$A$10003=M$6,ROW('quantities report_secondary'!$A$2:$A$10003)-1,\"\"),ROWS($B$8:$B12))),\"0\"))","v":""},{"$f":"IF($B12=\"\",\"\",IFERROR(INDEX('quantities report_secondary'!$D$2:$D$10003,SMALL(IF('quantities report_secondary'!$A$2:$A$10003=N$6,ROW('quantities report_secondary'!$A$2:$A$10003)-1,\"\"),ROWS($B$8:$B12))),\"0\"))","v":""},{"$f":"IF($B12=\"\",\"\",IFERROR(INDEX('quantities report_secondary'!$D$2:$D$10003,SMALL(IF('quantities report_secondary'!$A$2:$A$10003=O$6,ROW('quantities report_secondary'!$A$2:$A$10003)-1,\"\"),ROWS($B$8:$B12))),\"0\"))","v":""},"",{"$f":"IF($B12=\"\",\"\",IFERROR(INDEX('quantities report_secondary'!$D$2:$D$10003,SMALL(IF('quantities report_secondary'!$A$2:$A$10003=Q$6,ROW('quantities report_secondary'!$A$2:$A$10003)-1,\"\"),ROWS($B$8:$B12))),\"0\"))","v":""}]
[null,{"$f":"IFERROR(INDEX('manual inputs_secondary'!M:M,SMALL(IF('manual inputs_secondary'!M:M<>\"\",ROW('manual inputs_secondary'!M:M)),ROW(8:8))),\"\")","v":""},{"$f":"IF($B13=\"\",\"\",IFERROR(INDEX('quantities report_secondary'!$D$2:$D$10003,SMALL(IF('quantities report_secondary'!$A$2:$A$10003=C$6,ROW('quantities report_secondary'!$A$2:$A$10003)-1,\"\"),ROWS($B$8:$B13))),\"0\"))","v":""},{"$f":"IF($B13=\"\",\"\",IFERROR(INDEX('quantities report_secondary'!$D$2:$D$10003,SMALL(IF('quantities report_secondary'!$A$2:$A$10003=D$6,ROW('quantities report_secondary'!$A$2:$A$10003)-1,\"\"),ROWS($B$8:$B13))),\"0\"))","v":""},"",{"$f":"IF($B13=\"\",\"\",IFERROR(INDEX('quantities report_secondary'!$D$2:$D$10003,SMALL(IF('quantities report_secondary'!$A$2:$A$10003=F$6,ROW('quantities report_secondary'!$A$2:$A$10003)-1,\"\"),ROWS($B$8:$B13))),\"0\"))","v":""},{"$f":"IF($B13=\"\",\"\",IFERROR(INDEX('quantities report_secondary'!$D$2:$D$10003,SMALL(IF('quantities report_secondary'!$A$2:$A$10003=G$6,ROW('quantities report_secondary'!$A$2:$A$10003)-1,\"\"),ROWS($B$8:$B13))),\"0\"))","v":""},"",{"$f":"IF($B13=\"\",\"\",IFERROR(INDEX('quantities report_secondary'!$D$2:$D$10003,SMALL(IF('quantities report_secondary'!$A$2:$A$10003=I$6,ROW('quantities report_secondary'!$A$2:$A$10003)-1,\"\"),ROWS($B$8:$B13))),\"0\"))","v":""},{"$f":"IF($B13=\"\",\"\",IFERROR(INDEX('quantities report_secondary'!$D$2:$D$10003,SMALL(IF('quantities report_secondary'!$A$2:$A$10003=J$6,ROW('quantities report_secondary'!$A$2:$A$10003)-1,\"\"),ROWS($B$8:$B13))),\"0\"))","v":""},{"$f":"IF($B13=\"\",\"\",IFERROR(INDEX('quantities report_secondary'!$D$2:$D$10003,SMALL(IF('quantities report_secondary'!$A$2:$A$10003=K$6,ROW('quantities report_secondary'!$A$2:$A$10003)-1,\"\"),ROWS($B$8:$B13))),\"0\"))","v":""},{"$f":"IF($B13=\"\",\"\",IFERROR(INDEX('quantities report_secondary'!$D$2:$D$10003,SMALL(IF('quantities report_secondary'!$A$2:$A$10003=L$6,ROW('quantities report_secondary'!$A$2:$A$10003)-1,\"\"),ROWS($B$8:$B13))),\"0\"))","v":""},{"$f":"IF($B13=\"\",\"\",IFERROR(INDEX('quantities report_secondary'!$D$2:$D$10003,SMALL(IF('quantities report_secondary'!$A$2:$A$10003=M$6,ROW('quantities report_secondary'!$A$2:$A$10003)-1,\"\"),ROWS($B$8:$B13))),\"0\"))","v":""},{"$f":"IF($B13=\"\",\"\",IFERROR(INDEX('quantities report_secondary'!$D$2:$D$10003,SMALL(IF('quantities report_secondary'!$A$2:$A$10003=N$6,ROW('quantities report_secondary'!$A$2:$A$10003)-1,\"\"),ROWS($B$8:$B13))),\"0\"))","v":""},{"$f":"IF($B13=\"\",\"\",IFERROR(INDEX('quantities report_secondary'!$D$2:$D$10003,SMALL(IF('quantities report_secondary'!$A$2:$A$10003=O$6,ROW('quantities report_secondary'!$A$2:$A$10003)-1,\"\"),ROWS($B$8:$B13))),\"0\"))","v":""},"",{"$f":"IF($B13=\"\",\"\",IFERROR(INDEX('quantities report_secondary'!$D$2:$D$10003,SMALL(IF('quantities report_secondary'!$A$2:$A$10003=Q$6,ROW('quantities report_secondary'!$A$2:$A$10003)-1,\"\"),ROWS($B$8:$B13))),\"0\"))","v":""}]
[null,{"$f":"IFERROR(INDEX('manual inputs_secondary'!M:M,SMALL(IF('manual inputs_secondary'!M:M<>\"\",ROW('manual inputs_secondary'!M:M)),ROW(9:9))),\"\")","v":""},{"$f":"IF($B14=\"\",\"\",IFERROR(INDEX('quantities report_secondary'!$D$2:$D$10003,SMALL(IF('quantities report_secondary'!$A$2:$A$10003=C$6,ROW('quantities report_secondary'!$A$2:$A$10003)-1,\"\"),ROWS($B$8:$B14))),\"0\"))","v":""},{"$f":"IF($B14=\"\",\"\",IFERROR(INDEX('quantities report_secondary'!$D$2:$D$10003,SMALL(IF('quantities report_secondary'!$A$2:$A$10003=D$6,ROW('quantities report_secondary'!$A$2:$A$10003)-1,\"\"),ROWS($B$8:$B14))),\"0\"))","v":""},"",{"$f":"IF($B14=\"\",\"\",IFERROR(INDEX('quantities report_secondary'!$D$2:$D$10003,SMALL(IF('quantities report_secondary'!$A$2:$A$10003=F$6,ROW('quantities report_secondary'!$A$2:$A$10003)-1,\"\"),ROWS($B$8:$B14))),\"0\"))","v":""},{"$f":"IF($B14=\"\",\"\",IFERROR(INDEX('quantities report_secondary'!$D$2:$D$10003,SMALL(IF('quantities report_secondary'!$A$2:$A$10003=G$6,ROW('quantities report_secondary'!$A$2:$A$10003)-1,\"\"),ROWS($B$8:$B14))),\"0\"))","v":""},"",{"$f":"IF($B14=\"\",\"\",IFERROR(INDEX('quantities report_secondary'!$D$2:$D$10003,SMALL(IF('quantities report_secondary'!$A$2:$A$10003=I$6,ROW('quantities report_secondary'!$A$2:$A$10003)-1,\"\"),ROWS($B$8:$B14))),\"0\"))","v":""},{"$f":"IF($B14=\"\",\"\",IFERROR(INDEX('quantities report_secondary'!$D$2:$D$10003,SMALL(IF('quantities report_secondary'!$A$2:$A$10003=J$6,ROW('quantities report_secondary'!$A$2:$A$10003)-1,\"\"),ROWS($B$8:$B14))),\"0\"))","v":""},{"$f":"IF($B14=\"\",\"\",IFERROR(INDEX('quantities report_secondary'!$D$2:$D$10003,SMALL(IF('quantities report_secondary'!$A$2:$A$10003=K$6,ROW('quantities report_secondary'!$A$2:$A$10003)-1,\"\"),ROWS($B$8:$B14))),\"0\"))","v":""},{"$f":"IF($B14=\"\",\"\",IFERROR(INDEX('quantities report_secondary'!$D$2:$D$10003,SMALL(IF('quantities report_secondary'!$A$2:$A$10003=L$6,ROW('quantities report_secondary'!$A$2:$A$10003)-1,\"\"),ROWS($B$8:$B14))),\"0\"))","v":""},{"$f":"IF($B14=\"\",\"\",IFERROR(INDEX('quantities report_secondary'!$D$2:$D$10003,SMALL(IF('quantities report_secondary'!$A$2:$A$10003=M$6,ROW('quantities report_secondary'!$A$2:$A$10003)-1,\"\"),ROWS($B$8:$B14))),\"0\"))","v":""},{"$f":"IF($B14=\"\",\"\",IFERROR(INDEX('quantities report_secondary'!$D$2:$D$10003,SMALL(IF('quantities report_secondary'!$A$2:$A$10003=N$6,ROW('quantities report_secondary'!$A$2:$A$10003)-1,\"\"),ROWS($B$8:$B14))),\"0\"))","v":""},{"$f":"IF($B14=\"\",\"\",IFERROR(INDEX('quantities report_secondary'!$D$2:$D$10003,SMALL(IF('quantities report_secondary'!$A$2:$A$10003=O$6,ROW('quantities report_secondary'!$A$2:$A$10003)-1,\"\"),ROWS($B$8:$B14))),\"0\"))","v":""},"",{"$f":"IF($B14=\"\",\"\",IFERROR(INDEX('quantities report_secondary'!$D$2:$D$10003,SMALL(IF('quantities report_secondary'!$A$2:$A$10003=Q$6,ROW('quantities report_secondary'!$A$2:$A$10003)-1,\"\"),ROWS($B$8:$B14))),\"0\"))","v":""}]
[null,{"$f":"IFERROR(INDEX('manual inputs_secondary'!M:M,SMALL(IF('manual inputs_secondary'!M:M<>\"\",ROW('manual inputs_secondary'!M:M)),ROW(10:10))),\"\")","v":""},{"$f":"IF($B15=\"\",\"\",IFERROR(INDEX('quantities report_secondary'!$D$2:$D$10003,SMALL(IF('quantities report_secondary'!$A$2:$A$10003=C$6,ROW('quantities report_secondary'!$A$2:$A$10003)-1,\"\"),ROWS($B$8:$B15))),\"0\"))","v":""},{"$f":"IF($B15=\"\",\"\",IFERROR(INDEX('quantities report_secondary'!$D$2:$D$10003,SMALL(IF('quantities report_secondary'!$A$2:$A$10003=D$6,ROW('quantities report_secondary'!$A$2:$A$10003)-1,\"\"),ROWS($B$8:$B15))),\"0\"))","v":""},"",{"$f":"IF($B15=\"\",\"\",IFERROR(INDEX('quantities report_secondary'!$D$2:$D$10003,SMALL(IF('quantities report_secondary'!$A$2:$A$10003=F$6,ROW('quantities report_secondary'!$A$2:$A$10003)-1,\"\"),ROWS($B$8:$B15))),\"0\"))","v":""},{"$f":"IF($B15=\"\",\"\",IFERROR(INDEX('quantities report_secondary'!$D$2:$D$10003,SMALL(IF('quantities report_secondary'!$A$2:$A$10003=G$6,ROW('quantities report_secondary'!$A$2:$A$10003)-1,\"\"),ROWS($B$8:$B15))),\"0\"))","v":""},"",{"$f":"IF($B15=\"\",\"\",IFERROR(INDEX('quantities report_secondary'!$D$2:$D$10003,SMALL(IF('quantities report_secondary'!$A$2:$A$10003=I$6,ROW('quantities report_secondary'!$A$2:$A$10003)-1,\"\"),ROWS($B$8:$B15))),\"0\"))","v":""},{"$f":"IF($B15=\"\",\"\",IFERROR(INDEX('quantities report_secondary'!$D$2:$D$10003,SMALL(IF('quantities report_secondary'!$A$2:$A$10003=J$6,ROW('quantities report_secondary'!$A$2:$A$10003)-1,\"\"),ROWS($B$8:$B15))),\"0\"))","v":""},{"$f":"IF($B15=\"\",\"\",IFERROR(INDEX('quantities report_secondary'!$D$2:$D$10003,SMALL(IF('quantities report_secondary'!$A$2:$A$10003=K$6,ROW('quantities report_secondary'!$A$2:$A$10003)-1,\"\"),ROWS($B$8:$B15))),\"0\"))","v":""},{"$f":"IF($B15=\"\",\"\",IFERROR(INDEX('quantities report_secondary'!$D$2:$D$10003,SMALL(IF('quantities report_secondary'!$A$2:$A$10003=L$6,ROW('quantities report_secondary'!$A$2:$A$10003)-1,\"\"),ROWS($B$8:$B15))),\"0\"))","v":""},{"$f":"IF($B15=\"\",\"\",IFERROR(INDEX('quantities report_secondary'!$D$2:$D$10003,SMALL(IF('quantities report_secondary'!$A$2:$A$10003=M$6,ROW('quantities report_secondary'!$A$2:$A$10003)-1,\"\"),ROWS($B$8:$B15))),\"0\"))","v":""},{"$f":"IF($B15=\"\",\"\",IFERROR(INDEX('quantities report_secondary'!$D$2:$D$10003,SMALL(IF('quantities report_secondary'!$A$2:$A$10003=N$6,ROW('quantities report_secondary'!$A$2:$A$10003)-1,\"\"),ROWS($B$8:$B15))),\"0\"))","v":""},{"$f":"IF($B15=\"\",\"\",IFERROR(INDEX('quantities report_secondary'!$D$2:$D$10003,SMALL(IF('quantities report_secondary'!$A$2:$A$10003=O$6,ROW('quantities report_secondary'!$A$2:$A$10003)-1,\"\"),ROWS($B$8:$B15))),\"0\"))","v":""},"",{"$f":"IF($B15=\"\",\"\",IFERROR(INDEX('quantities report_secondary'!$D$2:$D$10003,SMALL(IF('quantities report_secondary'!$A$2:$A$10003=Q$6,ROW('quantities report_secondary'!$A$2:$A$10003)-1,\"\"),ROWS($B$8:$B15))),\"0\"))","v":""}]
[null,{"$f":"IFERROR(INDEX('manual inputs_secondary'!M:M,SMALL(IF('manual inputs_secondary'!M:M<>\"\",ROW('manual inputs_secondary'!M:M)),ROW(11:11))),\"\")","v":""},{"$f":"IF($B16=\"\",\"\",IFERROR(INDEX('quantities report_secondary'!$D$2:$D$10003,SMALL(IF('quantities report_secondary'!$A$2:$A$10003=C$6,ROW('quantities report_secondary'!$A$2:$A$10003)-1,\"\"),ROWS($B$8:$B16))),\"0\"))","v":""},{"$f":"IF($B16=\"\",\"\",IFERROR(INDEX('quantities report_secondary'!$D$2:$D$10003,SMALL(IF('quantities report_secondary'!$A$2:$A$10003=D$6,ROW('quantities report_secondary'!$A$2:$A$10003)-1,\"\"),ROWS($B$8:$B16))),\"0\"))","v":""},"",{"$f":"IF($B16=\"\",\"\",IFERROR(INDEX('quantities report_secondary'!$D$2:$D$10003,SMALL(IF('quantities report_secondary'!$A$2:$A$10003=F$6,ROW('quantities report_secondary'!$A$2:$A$10003)-1,\"\"),ROWS($B$8:$B16))),\"0\"))","v":""},{"$f":"IF($B16=\"\",\"\",IFERROR(INDEX('quantities report_secondary'!$D$2:$D$10003,SMALL(IF('quantities report_secondary'!$A$2:$A$10003=G$6,ROW('quantities report_secondary'!$A$2:$A$10003)-1,\"\"),ROWS($B$8:$B16))),\"0\"))","v":""},"",{"$f":"IF($B16=\"\",\"\",IFERROR(INDEX('quantities report_secondary'!$D$2:$D$10003,SMALL(IF('quantities report_secondary'!$A$2:$A$10003=I$6,ROW('quantities report_secondary'!$A$2:$A$10003)-1,\"\"),ROWS($B$8:$B16))),\"0\"))","v":""},{"$f":"IF($B16=\"\",\"\",IFERROR(INDEX('quantities report_secondary'!$D$2:$D$10003,SMALL(IF('quantities report_secondary'!$A$2:$A$10003=J$6,ROW('quantities report_secondary'!$A$2:$A$10003)-1,\"\"),ROWS($B$8:$B16))),\"0\"))","v":""},{"$f":"IF($B16=\"\",\"\",IFERROR(INDEX('quantities report_secondary'!$D$2:$D$10003,SMALL(IF('quantities report_secondary'!$A$2:$A$10003=K$6,ROW('quantities report_secondary'!$A$2:$A$10003)-1,\"\"),ROWS($B$8:$B16))),\"0\"))","v":""},{"$f":"IF($B16=\"\",\"\",IFERROR(INDEX('quantities report_secondary'!$D$2:$D$10003,SMALL(IF('quantities report_secondary'!$A$2:$A$10003=L$6,ROW('quantities report_secondary'!$A$2:$A$10003)-1,\"\"),ROWS($B$8:$B16))),\"0\"))","v":""},{"$f":"IF($B16=\"\",\"\",IFERROR(INDEX('quantities report_secondary'!$D$2:$D$10003,SMALL(IF('quantities report_secondary'!$A$2:$A$10003=M$6,ROW('quantities report_secondary'!$A$2:$A$10003)-1,\"\"),ROWS($B$8:$B16))),\"0\"))","v":""},{"$f":"IF($B16=\"\",\"\",IFERROR(INDEX('quantities report_secondary'!$D$2:$D$10003,SMALL(IF('quantities report_secondary'!$A$2:$A$10003=N$6,ROW('quantities report_secondary'!$A$2:$A$10003)-1,\"\"),ROWS($B$8:$B16))),\"0\"))","v":""},{"$f":"IF($B16=\"\",\"\",IFERROR(INDEX('quantities report_secondary'!$D$2:$D$10003,SMALL(IF('quantities report_secondary'!$A$2:$A$10003=O$6,ROW('quantities report_secondary'!$A$2:$A$10003)-1,\"\"),ROWS($B$8:$B16))),\"0\"))","v":""},"",{"$f":"IF($B16=\"\",\"\",IFERROR(INDEX('quantities report_secondary'!$D$2:$D$10003,SMALL(IF('quantities report_secondary'!$A$2:$A$10003=Q$6,ROW('quantities report_secondary'!$A$2:$A$10003)-1,\"\"),ROWS($B$8:$B16))),\"0\"))","v":""}]
[null,{"$f":"IFERROR(INDEX('manual inputs_secondary'!M:M,SMALL(IF('manual inputs_secondary'!M:M<>\"\",ROW('manual inputs_secondary'!M:M)),ROW(12:12))),\"\")","v":""},{"$f":"IF($B17=\"\",\"\",IFERROR(INDEX('quantities report_secondary'!$D$2:$D$10003,SMALL(IF('quantities report_secondary'!$A$2:$A$10003=C$6,ROW('quantities report_secondary'!$A$2:$A$10003)-1,\"\"),ROWS($B$8:$B17))),\"0\"))","v":""},{"$f":"IF($B17=\"\",\"\",IFERROR(INDEX('quantities report_secondary'!$D$2:$D$10003,SMALL(IF('quantities report_secondary'!$A$2:$A$10003=D$6,ROW('quantities report_secondary'!$A$2:$A$10003)-1,\"\"),ROWS($B$8:$B17))),\"0\"))","v":""},"",{"$f":"IF($B17=\"\",\"\",IFERROR(INDEX('quantities report_secondary'!$D$2:$D$10003,SMALL(IF('quantities report_secondary'!$A$2:$A$10003=F$6,ROW('quantities report_secondary'!$A$2:$A$10003)-1,\"\"),ROWS($B$8:$B17))),\"0\"))","v":""},{"$f":"IF($B17=\"\",\"\",IFERROR(INDEX('quantities report_secondary'!$D$2:$D$10003,SMALL(IF('quantities report_secondary'!$A$2:$A$10003=G$6,ROW('quantities report_secondary'!$A$2:$A$10003)-1,\"\"),ROWS($B$8:$B17))),\"0\"))","v":""},"",{"$f":"IF($B17=\"\",\"\",IFERROR(INDEX('quantities report_secondary'!$D$2:$D$10003,SMALL(IF('quantities report_secondary'!$A$2:$A$10003=I$6,ROW('quantities report_secondary'!$A$2:$A$10003)-1,\"\"),ROWS($B$8:$B17))),\"0\"))","v":""},{"$f":"IF($B17=\"\",\"\",IFERROR(INDEX('quantities report_secondary'!$D$2:$D$10003,SMALL(IF('quantities report_secondary'!$A$2:$A$10003=J$6,ROW('quantities report_secondary'!$A$2:$A$10003)-1,\"\"),ROWS($B$8:$B17))),\"0\"))","v":""},{"$f":"IF($B17=\"\",\"\",IFERROR(INDEX('quantities report_secondary'!$D$2:$D$10003,SMALL(IF('quantities report_secondary'!$A$2:$A$10003=K$6,ROW('quantities report_secondary'!$A$2:$A$10003)-1,\"\"),ROWS($B$8:$B17))),\"0\"))","v":""},{"$f":"IF($B17=\"\",\"\",IFERROR(INDEX('quantities report_secondary'!$D$2:$D$10003,SMALL(IF('quantities report_secondary'!$A$2:$A$10003=L$6,ROW('quantities report_secondary'!$A$2:$A$10003)-1,\"\"),ROWS($B$8:$B17))),\"0\"))","v":""},{"$f":"IF($B17=\"\",\"\",IFERROR(INDEX('quantities report_secondary'!$D$2:$D$10003,SMALL(IF('quantities report_secondary'!$A$2:$A$10003=M$6,ROW('quantities report_secondary'!$A$2:$A$10003)-1,\"\"),ROWS($B$8:$B17))),\"0\"))","v":""},{"$f":"IF($B17=\"\",\"\",IFERROR(INDEX('quantities report_secondary'!$D$2:$D$10003,SMALL(IF('quantities report_secondary'!$A$2:$A$10003=N$6,ROW('quantities report_secondary'!$A$2:$A$10003)-1,\"\"),ROWS($B$8:$B17))),\"0\"))","v":""},{"$f":"IF($B17=\"\",\"\",IFERROR(INDEX('quantities report_secondary'!$D$2:$D$10003,SMALL(IF('quantities report_secondary'!$A$2:$A$10003=O$6,ROW('quantities report_secondary'!$A$2:$A$10003)-1,\"\"),ROWS($B$8:$B17))),\"0\"))","v":""},"",{"$f":"IF($B17=\"\",\"\",IFERROR(INDEX('quantities report_secondary'!$D$2:$D$10003,SMALL(IF('quantities report_secondary'!$A$2:$A$10003=Q$6,ROW('quantities report_secondary'!$A$2:$A$10003)-1,\"\"),ROWS($B$8:$B17))),\"0\"))","v":""}]
[null,{"$f":"IFERROR(INDEX('manual inputs_secondary'!M:M,SMALL(IF('manual inputs_secondary'!M:M<>\"\",ROW('manual inputs_secondary'!M:M)),ROW(13:13))),\"\")","v":""},{"$f":"IF($B18=\"\",\"\",IFERROR(INDEX('quantities report_secondary'!$D$2:$D$10003,SMALL(IF('quantities report_secondary'!$A$2:$A$10003=C$6,ROW('quantities report_secondary'!$A$2:$A$10003)-1,\"\"),ROWS($B$8:$B18))),\"0\"))","v":""},{"$f":"IF($B18=\"\",\"\",IFERROR(INDEX('quantities report_secondary'!$D$2:$D$10003,SMALL(IF('quantities report_secondary'!$A$2:$A$10003=D$6,ROW('quantities report_secondary'!$A$2:$A$10003)-1,\"\"),ROWS($B$8:$B18))),\"0\"))","v":""},"",{"$f":"IF($B18=\"\",\"\",IFERROR(INDEX('quantities report_secondary'!$D$2:$D$10003,SMALL(IF('quantities report_secondary'!$A$2:$A$10003=F$6,ROW('quantities report_secondary'!$A$2:$A$10003)-1,\"\"),ROWS($B$8:$B18))),\"0\"))","v":""},{"$f":"IF($B18=\"\",\"\",IFERROR(INDEX('quantities report_secondary'!$D$2:$D$10003,SMALL(IF('quantities report_secondary'!$A$2:$A$10003=G$6,ROW('quantities report_secondary'!$A$2:$A$10003)-1,\"\"),ROWS($B$8:$B18))),\"0\"))","v":""},"",{"$f":"IF($B18=\"\",\"\",IFERROR(INDEX('quantities report_secondary'!$D$2:$D$10003,SMALL(IF('quantities report_secondary'!$A$2:$A$10003=I$6,ROW('quantities report_secondary'!$A$2:$A$10003)-1,\"\"),ROWS($B$8:$B18))),\"0\"))","v":""},{"$f":"IF($B18=\"\",\"\",IFERROR(INDEX('quantities report_secondary'!$D$2:$D$10003,SMALL(IF('quantities report_secondary'!$A$2:$A$10003=J$6,ROW('quantities report_secondary'!$A$2:$A$10003)-1,\"\"),ROWS($B$8:$B18))),\"0\"))","v":""},{"$f":"IF($B18=\"\",\"\",IFERROR(INDEX('quantities report_secondary'!$D$2:$D$10003,SMALL(IF('quantities report_secondary'!$A$2:$A$10003=K$6,ROW('quantities report_secondary'!$A$2:$A$10003)-1,\"\"),ROWS($B$8:$B18))),\"0\"))","v":""},{"$f":"IF($B18=\"\",\"\",IFERROR(INDEX('quantities report_secondary'!$D$2:$D$10003,SMALL(IF('quantities report_secondary'!$A$2:$A$10003=L$6,ROW('quantities report_secondary'!$A$2:$A$10003)-1,\"\"),ROWS($B$8:$B18))),\"0\"))","v":""},{"$f":"IF($B18=\"\",\"\",IFERROR(INDEX('quantities report_secondary'!$D$2:$D$10003,SMALL(IF('quantities report_secondary'!$A$2:$A$10003=M$6,ROW('quantities report_secondary'!$A$2:$A$10003)-1,\"\"),ROWS($B$8:$B18))),\"0\"))","v":""},{"$f":"IF($B18=\"\",\"\",IFERROR(INDEX('quantities report_secondary'!$D$2:$D$10003,SMALL(IF('quantities report_secondary'!$A$2:$A$10003=N$6,ROW('quantities report_secondary'!$A$2:$A$10003)-1,\"\"),ROWS($B$8:$B18))),\"0\"))","v":""},{"$f":"IF($B18=\"\",\"\",IFERROR(INDEX('quantities report_secondary'!$D$2:$D$10003,SMALL(IF('quantities report_secondary'!$A$2:$A$10003=O$6,ROW('quantities report_secondary'!$A$2:$A$10003)-1,\"\"),ROWS($B$8:$B18))),\"0\"))","v":""},"",{"$f":"IF($B18=\"\",\"\",IFERROR(INDEX('quantities report_secondary'!$D$2:$D$10003,SMALL(IF('quantities report_secondary'!$A$2:$A$10003=Q$6,ROW('quantities report_secondary'!$A$2:$A$10003)-1,\"\"),ROWS($B$8:$B18))),\"0\"))","v":""}]
[null,{"$f":"IFERROR(INDEX('manual inputs_secondary'!M:M,SMALL(IF('manual inputs_secondary'!M:M<>\"\",ROW('manual inputs_secondary'!M:M)),ROW(14:14))),\"\")","v":""},{"$f":"IF($B19=\"\",\"\",IFERROR(INDEX('quantities report_secondary'!$D$2:$D$10003,SMALL(IF('quantities report_secondary'!$A$2:$A$10003=C$6,ROW('quantities report_secondary'!$A$2:$A$10003)-1,\"\"),ROWS($B$8:$B19))),\"0\"))","v":""},{"$f":"IF($B19=\"\",\"\",IFERROR(INDEX('quantities report_secondary'!$D$2:$D$10003,SMALL(IF('quantities report_secondary'!$A$2:$A$10003=D$6,ROW('quantities report_secondary'!$A$2:$A$10003)-1,\"\"),ROWS($B$8:$B19))),\"0\"))","v":""},"",{"$f":"IF($B19=\"\",\"\",IFERROR(INDEX('quantities report_secondary'!$D$2:$D$10003,SMALL(IF('quantities report_secondary'!$A$2:$A$10003=F$6,ROW('quantities report_secondary'!$A$2:$A$10003)-1,\"\"),ROWS($B$8:$B19))),\"0\"))","v":""},{"$f":"IF($B19=\"\",\"\",IFERROR(INDEX('quantities report_secondary'!$D$2:$D$10003,SMALL(IF('quantities report_secondary'!$A$2:$A$10003=G$6,ROW('quantities report_secondary'!$A$2:$A$10003)-1,\"\"),ROWS($B$8:$B19))),\"0\"))","v":""},"",{"$f":"IF($B19=\"\",\"\",IFERROR(INDEX('quantities report_secondary'!$D$2:$D$10003,SMALL(IF('quantities report_secondary'!$A$2:$A$10003=I$6,ROW('quantities report_secondary'!$A$2:$A$10003)-1,\"\"),ROWS($B$8:$B19))),\"0\"))","v":""},{"$f":"IF($B19=\"\",\"\",IFERROR(INDEX('quantities report_secondary'!$D$2:$D$10003,SMALL(IF('quantities report_secondary'!$A$2:$A$10003=J$6,ROW('quantities report_secondary'!$A$2:$A$10003)-1,\"\"),ROWS($B$8:$B19))),\"0\"))","v":""},{"$f":"IF($B19=\"\",\"\",IFERROR(INDEX('quantities report_secondary'!$D$2:$D$10003,SMALL(IF('quantities report_secondary'!$A$2:$A$10003=K$6,ROW('quantities report_secondary'!$A$2:$A$10003)-1,\"\"),ROWS($B$8:$B19))),\"0\"))","v":""},{"$f":"IF($B19=\"\",\"\",IFERROR(INDEX('quantities report_secondary'!$D$2:$D$10003,SMALL(IF('quantities report_secondary'!$A$2:$A$10003=L$6,ROW('quantities report_secondary'!$A$2:$A$10003)-1,\"\"),ROWS($B$8:$B19))),\"0\"))","v":""},{"$f":"IF($B19=\"\",\"\",IFERROR(INDEX('quantities report_secondary'!$D$2:$D$10003,SMALL(IF('quantities report_secondary'!$A$2:$A$10003=M$6,ROW('quantities report_secondary'!$A$2:$A$10003)-1,\"\"),ROWS($B$8:$B19))),\"0\"))","v":""},{"$f":"IF($B19=\"\",\"\",IFERROR(INDEX('quantities report_secondary'!$D$2:$D$10003,SMALL(IF('quantities report_secondary'!$A$2:$A$10003=N$6,ROW('quantities report_secondary'!$A$2:$A$10003)-1,\"\"),ROWS($B$8:$B19))),\"0\"))","v":""},{"$f":"IF($B19=\"\",\"\",IFERROR(INDEX('quantities report_secondary'!$D$2:$D$10003,SMALL(IF('quantities report_secondary'!$A$2:$A$10003=O$6,ROW('quantities report_secondary'!$A$2:$A$10003)-1,\"\"),ROWS($B$8:$B19))),\"0\"))","v":""},"",{"$f":"IF($B19=\"\",\"\",IFERROR(INDEX('quantities report_secondary'!$D$2:$D$10003,SMALL(IF('quantities report_secondary'!$A$2:$A$10003=Q$6,ROW('quantities report_secondary'!$A$2:$A$10003)-1,\"\"),ROWS($B$8:$B19))),\"0\"))","v":""}]
[null,{"$f":"IFERROR(INDEX('manual inputs_secondary'!M:M,SMALL(IF('manual inputs_secondary'!M:M<>\"\",ROW('manual inputs_secondary'!M:M)),ROW(15:15))),\"\")","v":""},{"$f":"IF($B20=\"\",\"\",IFERROR(INDEX('quantities report_secondary'!$D$2:$D$10003,SMALL(IF('quantities report_secondary'!$A$2:$A$10003=C$6,ROW('quantities report_secondary'!$A$2:$A$10003)-1,\"\"),ROWS($B$8:$B20))),\"0\"))","v":""},{"$f":"IF($B20=\"\",\"\",IFERROR(INDEX('quantities report_secondary'!$D$2:$D$10003,SMALL(IF('quantities report_secondary'!$A$2:$A$10003=D$6,ROW('quantities report_secondary'!$A$2:$A$10003)-1,\"\"),ROWS($B$8:$B20))),\"0\"))","v":""},"",{"$f":"IF($B20=\"\",\"\",IFERROR(INDEX('quantities report_secondary'!$D$2:$D$10003,SMALL(IF('quantities report_secondary'!$A$2:$A$10003=F$6,ROW('quantities report_secondary'!$A$2:$A$10003)-1,\"\"),ROWS($B$8:$B20))),\"0\"))","v":""},{"$f":"IF($B20=\"\",\"\",IFERROR(INDEX('quantities report_secondary'!$D$2:$D$10003,SMALL(IF('quantities report_secondary'!$A$2:$A$10003=G$6,ROW('quantities report_secondary'!$A$2:$A$10003)-1,\"\"),ROWS($B$8:$B20))),\"0\"))","v":""},"",{"$f":"IF($B20=\"\",\"\",IFERROR(INDEX('quantities report_secondary'!$D$2:$D$10003,SMALL(IF('quantities report_secondary'!$A$2:$A$10003=I$6,ROW('quantities report_secondary'!$A$2:$A$10003)-1,\"\"),ROWS($B$8:$B20))),\"0\"))","v":""},{"$f":"IF($B20=\"\",\"\",IFERROR(INDEX('quantities report_secondary'!$D$2:$D$10003,SMALL(IF('quantities report_secondary'!$A$2:$A$10003=J$6,ROW('quantities report_secondary'!$A$2:$A$10003)-1,\"\"),ROWS($B$8:$B20))),\"0\"))","v":""},{"$f":"IF($B20=\"\",\"\",IFERROR(INDEX('quantities report_secondary'!$D$2:$D$10003,SMALL(IF('quantities report_secondary'!$A$2:$A$10003=K$6,ROW('quantities report_secondary'!$A$2:$A$10003)-1,\"\"),ROWS($B$8:$B20))),\"0\"))","v":""},{"$f":"IF($B20=\"\",\"\",IFERROR(INDEX('quantities report_secondary'!$D$2:$D$10003,SMALL(IF('quantities report_secondary'!$A$2:$A$10003=L$6,ROW('quantities report_secondary'!$A$2:$A$10003)-1,\"\"),ROWS($B$8:$B20))),\"0\"))","v":""},{"$f":"IF($B20=\"\",\"\",IFERROR(INDEX('quantities report_secondary'!$D$2:$D$10003,SMALL(IF('quantities report_secondary'!$A$2:$A$10003=M$6,ROW('quantities report_secondary'!$A$2:$A$10003)-1,\"\"),ROWS($B$8:$B20))),\"0\"))","v":""},{"$f":"IF($B20=\"\",\"\",IFERROR(INDEX('quantities report_secondary'!$D$2:$D$10003,SMALL(IF('quantities report_secondary'!$A$2:$A$10003=N$6,ROW('quantities report_secondary'!$A$2:$A$10003)-1,\"\"),ROWS($B$8:$B20))),\"0\"))","v":""},{"$f":"IF($B20=\"\",\"\",IFERROR(INDEX('quantities report_secondary'!$D$2:$D$10003,SMALL(IF('quantities report_secondary'!$A$2:$A$10003=O$6,ROW('quantities report_secondary'!$A$2:$A$10003)-1,\"\"),ROWS($B$8:$B20))),\"0\"))","v":""},"",{"$f":"IF($B20=\"\",\"\",IFERROR(INDEX('quantities report_secondary'!$D$2:$D$10003,SMALL(IF('quantities report_secondary'!$A$2:$A$10003=Q$6,ROW('quantities report_secondary'!$A$2:$A$10003)-1,\"\"),ROWS($B$8:$B20))),\"0\"))","v":""}]
[null,{"$f":"IFERROR(INDEX('manual inputs_secondary'!M:M,SMALL(IF('manual inputs_secondary'!M:M<>\"\",ROW('manual inputs_secondary'!M:M)),ROW(16:16))),\"\")","v":""},{"$f":"IF($B21=\"\",\"\",IFERROR(INDEX('quantities report_secondary'!$D$2:$D$10003,SMALL(IF('quantities report_secondary'!$A$2:$A$10003=C$6,ROW('quantities report_secondary'!$A$2:$A$10003)-1,\"\"),ROWS($B$8:$B21))),\"0\"))","v":""},{"$f":"IF($B21=\"\",\"\",IFERROR(INDEX('quantities report_secondary'!$D$2:$D$10003,SMALL(IF('quantities report_secondary'!$A$2:$A$10003=D$6,ROW('quantities report_secondary'!$A$2:$A$10003)-1,\"\"),ROWS($B$8:$B21))),\"0\"))","v":""},"",{"$f":"IF($B21=\"\",\"\",IFERROR(INDEX('quantities report_secondary'!$D$2:$D$10003,SMALL(IF('quantities report_secondary'!$A$2:$A$10003=F$6,ROW('quantities report_secondary'!$A$2:$A$10003)-1,\"\"),ROWS($B$8:$B21))),\"0\"))","v":""},{"$f":"IF($B21=\"\",\"\",IFERROR(INDEX('quantities report_secondary'!$D$2:$D$10003,SMALL(IF('quantities report_secondary'!$A$2:$A$10003=G$6,ROW('quantities report_secondary'!$A$2:$A$10003)-1,\"\"),ROWS($B$8:$B21))),\"0\"))","v":""},"",{"$f":"IF($B21=\"\",\"\",IFERROR(INDEX('quantities report_secondary'!$D$2:$D$10003,SMALL(IF('quantities report_secondary'!$A$2:$A$10003=I$6,ROW('quantities report_secondary'!$A$2:$A$10003)-1,\"\"),ROWS($B$8:$B21))),\"0\"))","v":""},{"$f":"IF($B21=\"\",\"\",IFERROR(INDEX('quantities report_secondary'!$D$2:$D$10003,SMALL(IF('quantities report_secondary'!$A$2:$A$10003=J$6,ROW('quantities report_secondary'!$A$2:$A$10003)-1,\"\"),ROWS($B$8:$B21))),\"0\"))","v":""},{"$f":"IF($B21=\"\",\"\",IFERROR(INDEX('quantities report_secondary'!$D$2:$D$10003,SMALL(IF('quantities report_secondary'!$A$2:$A$10003=K$6,ROW('quantities report_secondary'!$A$2:$A$10003)-1,\"\"),ROWS($B$8:$B21))),\"0\"))","v":""},{"$f":"IF($B21=\"\",\"\",IFERROR(INDEX('quantities report_secondary'!$D$2:$D$10003,SMALL(IF('quantities report_secondary'!$A$2:$A$10003=L$6,ROW('quantities report_secondary'!$A$2:$A$10003)-1,\"\"),ROWS($B$8:$B21))),\"0\"))","v":""},{"$f":"IF($B21=\"\",\"\",IFERROR(INDEX('quantities report_secondary'!$D$2:$D$10003,SMALL(IF('quantities report_secondary'!$A$2:$A$10003=M$6,ROW('quantities report_secondary'!$A$2:$A$10003)-1,\"\"),ROWS($B$8:$B21))),\"0\"))","v":""},{"$f":"IF($B21=\"\",\"\",IFERROR(INDEX('quantities report_secondary'!$D$2:$D$10003,SMALL(IF('quantities report_secondary'!$A$2:$A$10003=N$6,ROW('quantities report_secondary'!$A$2:$A$10003)-1,\"\"),ROWS($B$8:$B21))),\"0\"))","v":""},{"$f":"IF($B21=\"\",\"\",IFERROR(INDEX('quantities report_secondary'!$D$2:$D$10003,SMALL(IF('quantities report_secondary'!$A$2:$A$10003=O$6,ROW('quantities report_secondary'!$A$2:$A$10003)-1,\"\"),ROWS($B$8:$B21))),\"0\"))","v":""},"",{"$f":"IF($B21=\"\",\"\",IFERROR(INDEX('quantities report_secondary'!$D$2:$D$10003,SMALL(IF('quantities report_secondary'!$A$2:$A$10003=Q$6,ROW('quantities report_secondary'!$A$2:$A$10003)-1,\"\"),ROWS($B$8:$B21))),\"0\"))","v":""}]
[null,{"$f":"IFERROR(INDEX('manual inputs_secondary'!M:M,SMALL(IF('manual inputs_secondary'!M:M<>\"\",ROW('manual inputs_secondary'!M:M)),ROW(17:17))),\"\")","v":""},{"$f":"IF($B22=\"\",\"\",IFERROR(INDEX('quantities report_secondary'!$D$2:$D$10003,SMALL(IF('quantities report_secondary'!$A$2:$A$10003=C$6,ROW('quantities report_secondary'!$A$2:$A$10003)-1,\"\"),ROWS($B$8:$B22))),\"0\"))","v":""},{"$f":"IF($B22=\"\",\"\",IFERROR(INDEX('quantities report_secondary'!$D$2:$D$10003,SMALL(IF('quantities report_secondary'!$A$2:$A$10003=D$6,ROW('quantities report_secondary'!$A$2:$A$10003)-1,\"\"),ROWS($B$8:$B22))),\"0\"))","v":""},"",{"$f":"IF($B22=\"\",\"\",IFERROR(INDEX('quantities report_secondary'!$D$2:$D$10003,SMALL(IF('quantities report_secondary'!$A$2:$A$10003=F$6,ROW('quantities report_secondary'!$A$2:$A$10003)-1,\"\"),ROWS($B$8:$B22))),\"0\"))","v":""},{"$f":"IF($B22=\"\",\"\",IFERROR(INDEX('quantities report_secondary'!$D$2:$D$10003,SMALL(IF('quantities report_secondary'!$A$2:$A$10003=G$6,ROW('quantities report_secondary'!$A$2:$A$10003)-1,\"\"),ROWS($B$8:$B22))),\"0\"))","v":""},"",{"$f":"IF($B22=\"\",\"\",IFERROR(INDEX('quantities report_secondary'!$D$2:$D$10003,SMALL(IF('quantities report_secondary'!$A$2:$A$10003=I$6,ROW('quantities report_secondary'!$A$2:$A$10003)-1,\"\"),ROWS($B$8:$B22))),\"0\"))","v":""},{"$f":"IF($B22=\"\",\"\",IFERROR(INDEX('quantities report_secondary'!$D$2:$D$10003,SMALL(IF('quantities report_secondary'!$A$2:$A$10003=J$6,ROW('quantities report_secondary'!$A$2:$A$10003)-1,\"\"),ROWS($B$8:$B22))),\"0\"))","v":""},{"$f":"IF($B22=\"\",\"\",IFERROR(INDEX('quantities report_secondary'!$D$2:$D$10003,SMALL(IF('quantities report_secondary'!$A$2:$A$10003=K$6,ROW('quantities report_secondary'!$A$2:$A$10003)-1,\"\"),ROWS($B$8:$B22))),\"0\"))","v":""},{"$f":"IF($B22=\"\",\"\",IFERROR(INDEX('quantities report_secondary'!$D$2:$D$10003,SMALL(IF('quantities report_secondary'!$A$2:$A$10003=L$6,ROW('quantities report_secondary'!$A$2:$A$10003)-1,\"\"),ROWS($B$8:$B22))),\"0\"))","v":""},{"$f":"IF($B22=\"\",\"\",IFERROR(INDEX('quantities report_secondary'!$D$2:$D$10003,SMALL(IF('quantities report_secondary'!$A$2:$A$10003=M$6,ROW('quantities report_secondary'!$A$2:$A$10003)-1,\"\"),ROWS($B$8:$B22))),\"0\"))","v":""},{"$f":"IF($B22=\"\",\"\",IFERROR(INDEX('quantities report_secondary'!$D$2:$D$10003,SMALL(IF('quantities report_secondary'!$A$2:$A$10003=N$6,ROW('quantities report_secondary'!$A$2:$A$10003)-1,\"\"),ROWS($B$8:$B22))),\"0\"))","v":""},{"$f":"IF($B22=\"\",\"\",IFERROR(INDEX('quantities report_secondary'!$D$2:$D$10003,SMALL(IF('quantities report_secondary'!$A$2:$A$10003=O$6,ROW('quantities report_secondary'!$A$2:$A$10003)-1,\"\"),ROWS($B$8:$B22))),\"0\"))","v":""},"",{"$f":"IF($B22=\"\",\"\",IFERROR(INDEX('quantities report_secondary'!$D$2:$D$10003,SMALL(IF('quantities report_secondary'!$A$2:$A$10003=Q$6,ROW('quantities report_secondary'!$A$2:$A$10003)-1,\"\"),ROWS($B$8:$B22))),\"0\"))","v":""}]
[null,{"$f":"IFERROR(INDEX('manual inputs_secondary'!M:M,SMALL(IF('manual inputs_secondary'!M:M<>\"\",ROW('manual inputs_secondary'!M:M)),ROW(18:18))),\"\")","v":""},{"$f":"IF($B23=\"\",\"\",IFERROR(INDEX('quantities report_secondary'!$D$2:$D$10003,SMALL(IF('quantities report_secondary'!$A$2:$A$10003=C$6,ROW('quantities report_secondary'!$A$2:$A$10003)-1,\"\"),ROWS($B$8:$B23))),\"0\"))","v":""},{"$f":"IF($B23=\"\",\"\",IFERROR(INDEX('quantities report_secondary'!$D$2:$D$10003,SMALL(IF('quantities report_secondary'!$A$2:$A$10003=D$6,ROW('quantities report_secondary'!$A$2:$A$10003)-1,\"\"),ROWS($B$8:$B23))),\"0\"))","v":""},"",{"$f":"IF($B23=\"\",\"\",IFERROR(INDEX('quantities report_secondary'!$D$2:$D$10003,SMALL(IF('quantities report_secondary'!$A$2:$A$10003=F$6,ROW('quantities report_secondary'!$A$2:$A$10003)-1,\"\"),ROWS($B$8:$B23))),\"0\"))","v":""},{"$f":"IF($B23=\"\",\"\",IFERROR(INDEX('quantities report_secondary'!$D$2:$D$10003,SMALL(IF('quantities report_secondary'!$A$2:$A$10003=G$6,ROW('quantities report_secondary'!$A$2:$A$10003)-1,\"\"),ROWS($B$8:$B23))),\"0\"))","v":""},"",{"$f":"IF($B23=\"\",\"\",IFERROR(INDEX('quantities report_secondary'!$D$2:$D$10003,SMALL(IF('quantities report_secondary'!$A$2:$A$10003=I$6,ROW('quantities report_secondary'!$A$2:$A$10003)-1,\"\"),ROWS($B$8:$B23))),\"0\"))","v":""},{"$f":"IF($B23=\"\",\"\",IFERROR(INDEX('quantities report_secondary'!$D$2:$D$10003,SMALL(IF('quantities report_secondary'!$A$2:$A$10003=J$6,ROW('quantities report_secondary'!$A$2:$A$10003)-1,\"\"),ROWS($B$8:$B23))),\"0\"))","v":""},{"$f":"IF($B23=\"\",\"\",IFERROR(INDEX('quantities report_secondary'!$D$2:$D$10003,SMALL(IF('quantities report_secondary'!$A$2:$A$10003=K$6,ROW('quantities report_secondary'!$A$2:$A$10003)-1,\"\"),ROWS($B$8:$B23))),\"0\"))","v":""},{"$f":"IF($B23=\"\",\"\",IFERROR(INDEX('quantities report_secondary'!$D$2:$D$10003,SMALL(IF('quantities report_secondary'!$A$2:$A$10003=L$6,ROW('quantities report_secondary'!$A$2:$A$10003)-1,\"\"),ROWS($B$8:$B23))),\"0\"))","v":""},{"$f":"IF($B23=\"\",\"\",IFERROR(INDEX('quantities report_secondary'!$D$2:$D$10003,SMALL(IF('quantities report_secondary'!$A$2:$A$10003=M$6,ROW('quantities report_secondary'!$A$2:$A$10003)-1,\"\"),ROWS($B$8:$B23))),\"0\"))","v":""},{"$f":"IF($B23=\"\",\"\",IFERROR(INDEX('quantities report_secondary'!$D$2:$D$10003,SMALL(IF('quantities report_secondary'!$A$2:$A$10003=N$6,ROW('quantities report_secondary'!$A$2:$A$10003)-1,\"\"),ROWS($B$8:$B23))),\"0\"))","v":""},{"$f":"IF($B23=\"\",\"\",IFERROR(INDEX('quantities report_secondary'!$D$2:$D$10003,SMALL(IF('quantities report_secondary'!$A$2:$A$10003=O$6,ROW('quantities report_secondary'!$A$2:$A$10003)-1,\"\"),ROWS($B$8:$B23))),\"0\"))","v":""},"",{"$f":"IF($B23=\"\",\"\",IFERROR(INDEX('quantities report_secondary'!$D$2:$D$10003,SMALL(IF('quantities report_secondary'!$A$2:$A$10003=Q$6,ROW('quantities report_secondary'!$A$2:$A$10003)-1,\"\"),ROWS($B$8:$B23))),\"0\"))","v":""}]
[null,{"$f":"IFERROR(INDEX('manual inputs_secondary'!M:M,SMALL(IF('manual inputs_secondary'!M:M<>\"\",ROW('manual inputs_secondary'!M:M)),ROW(19:19))),\"\")","v":""},{"$f":"IF($B24=\"\",\"\",IFERROR(INDEX('quantities report_secondary'!$D$2:$D$10003,SMALL(IF('quantities report_secondary'!$A$2:$A$10003=C$6,ROW('quantities report_secondary'!$A$2:$A$10003)-1,\"\"),ROWS($B$8:$B24))),\"0\"))","v":""},{"$f":"IF($B24=\"\",\"\",IFERROR(INDEX('quantities report_secondary'!$D$2:$D$10003,SMALL(IF('quantities report_secondary'!$A$2:$A$10003=D$6,ROW('quantities report_secondary'!$A$2:$A$10003)-1,\"\"),ROWS($B$8:$B24))),\"0\"))","v":""},"",{"$f":"IF($B24=\"\",\"\",IFERROR(INDEX('quantities report_secondary'!$D$2:$D$10003,SMALL(IF('quantities report_secondary'!$A$2:$A$10003=F$6,ROW('quantities report_secondary'!$A$2:$A$10003)-1,\"\"),ROWS($B$8:$B24))),\"0\"))","v":""},{"$f":"IF($B24=\"\",\"\",IFERROR(INDEX('quantities report_secondary'!$D$2:$D$10003,SMALL(IF('quantities report_secondary'!$A$2:$A$10003=G$6,ROW('quantities report_secondary'!$A$2:$A$10003)-1,\"\"),ROWS($B$8:$B24))),\"0\"))","v":""},"",{"$f":"IF($B24=\"\",\"\",IFERROR(INDEX('quantities report_secondary'!$D$2:$D$10003,SMALL(IF('quantities report_secondary'!$A$2:$A$10003=I$6,ROW('quantities report_secondary'!$A$2:$A$10003)-1,\"\"),ROWS($B$8:$B24))),\"0\"))","v":""},{"$f":"IF($B24=\"\",\"\",IFERROR(INDEX('quantities report_secondary'!$D$2:$D$10003,SMALL(IF('quantities report_secondary'!$A$2:$A$10003=J$6,ROW('quantities report_secondary'!$A$2:$A$10003)-1,\"\"),ROWS($B$8:$B24))),\"0\"))","v":""},{"$f":"IF($B24=\"\",\"\",IFERROR(INDEX('quantities report_secondary'!$D$2:$D$10003,SMALL(IF('quantities report_secondary'!$A$2:$A$10003=K$6,ROW('quantities report_secondary'!$A$2:$A$10003)-1,\"\"),ROWS($B$8:$B24))),\"0\"))","v":""},{"$f":"IF($B24=\"\",\"\",IFERROR(INDEX('quantities report_secondary'!$D$2:$D$10003,SMALL(IF('quantities report_secondary'!$A$2:$A$10003=L$6,ROW('quantities report_secondary'!$A$2:$A$10003)-1,\"\"),ROWS($B$8:$B24))),\"0\"))","v":""},{"$f":"IF($B24=\"\",\"\",IFERROR(INDEX('quantities report_secondary'!$D$2:$D$10003,SMALL(IF('quantities report_secondary'!$A$2:$A$10003=M$6,ROW('quantities report_secondary'!$A$2:$A$10003)-1,\"\"),ROWS($B$8:$B24))),\"0\"))","v":""},{"$f":"IF($B24=\"\",\"\",IFERROR(INDEX('quantities report_secondary'!$D$2:$D$10003,SMALL(IF('quantities report_secondary'!$A$2:$A$10003=N$6,ROW('quantities report_secondary'!$A$2:$A$10003)-1,\"\"),ROWS($B$8:$B24))),\"0\"))","v":""},{"$f":"IF($B24=\"\",\"\",IFERROR(INDEX('quantities report_secondary'!$D$2:$D$10003,SMALL(IF('quantities report_secondary'!$A$2:$A$10003=O$6,ROW('quantities report_secondary'!$A$2:$A$10003)-1,\"\"),ROWS($B$8:$B24))),\"0\"))","v":""},"",{"$f":"IF($B24=\"\",\"\",IFERROR(INDEX('quantities report_secondary'!$D$2:$D$10003,SMALL(IF('quantities report_secondary'!$A$2:$A$10003=Q$6,ROW('quantities report_secondary'!$A$2:$A$10003)-1,\"\"),ROWS($B$8:$B24))),\"0\"))","v":""}]
[null,{"$f":"IFERROR(INDEX('manual inputs_secondary'!M:M,SMALL(IF('manual inputs_secondary'!M:M<>\"\",ROW('manual inputs_secondary'!M:M)),ROW(20:20))),\"\")","v":""},{"$f":"IF($B25=\"\",\"\",IFERROR(INDEX('quantities report_secondary'!$D$2:$D$10003,SMALL(IF('quantities report_secondary'!$A$2:$A$10003=C$6,ROW('quantities report_secondary'!$A$2:$A$10003)-1,\"\"),ROWS($B$8:$B25))),\"0\"))","v":""},{"$f":"IF($B25=\"\",\"\",IFERROR(INDEX('quantities report_secondary'!$D$2:$D$10003,SMALL(IF('quantities report_secondary'!$A$2:$A$10003=D$6,ROW('quantities report_secondary'!$A$2:$A$10003)-1,\"\"),ROWS($B$8:$B25))),\"0\"))","v":""},"",{"$f":"IF($B25=\"\",\"\",IFERROR(INDEX('quantities report_secondary'!$D$2:$D$10003,SMALL(IF('quantities report_secondary'!$A$2:$A$10003=F$6,ROW('quantities report_secondary'!$A$2:$A$10003)-1,\"\"),ROWS($B$8:$B25))),\"0\"))","v":""},{"$f":"IF($B25=\"\",\"\",IFERROR(INDEX('quantities report_secondary'!$D$2:$D$10003,SMALL(IF('quantities report_secondary'!$A$2:$A$10003=G$6,ROW('quantities report_secondary'!$A$2:$A$10003)-1,\"\"),ROWS($B$8:$B25))),\"0\"))","v":""},"",{"$f":"IF($B25=\"\",\"\",IFERROR(INDEX('quantities report_secondary'!$D$2:$D$10003,SMALL(IF('quantities report_secondary'!$A$2:$A$10003=I$6,ROW('quantities report_secondary'!$A$2:$A$10003)-1,\"\"),ROWS($B$8:$B25))),\"0\"))","v":""},{"$f":"IF($B25=\"\",\"\",IFERROR(INDEX('quantities report_secondary'!$D$2:$D$10003,SMALL(IF('quantities report_secondary'!$A$2:$A$10003=J$6,ROW('quantities report_secondary'!$A$2:$A$10003)-1,\"\"),ROWS($B$8:$B25))),\"0\"))","v":""},{"$f":"IF($B25=\"\",\"\",IFERROR(INDEX('quantities report_secondary'!$D$2:$D$10003,SMALL(IF('quantities report_secondary'!$A$2:$A$10003=K$6,ROW('quantities report_secondary'!$A$2:$A$10003)-1,\"\"),ROWS($B$8:$B25))),\"0\"))","v":""},{"$f":"IF($B25=\"\",\"\",IFERROR(INDEX('quantities report_secondary'!$D$2:$D$10003,SMALL(IF('quantities report_secondary'!$A$2:$A$10003=L$6,ROW('quantities report_secondary'!$A$2:$A$10003)-1,\"\"),ROWS($B$8:$B25))),\"0\"))","v":""},{"$f":"IF($B25=\"\",\"\",IFERROR(INDEX('quantities report_secondary'!$D$2:$D$10003,SMALL(IF('quantities report_secondary'!$A$2:$A$10003=M$6,ROW('quantities report_secondary'!$A$2:$A$10003)-1,\"\"),ROWS($B$8:$B25))),\"0\"))","v":""},{"$f":"IF($B25=\"\",\"\",IFERROR(INDEX('quantities report_secondary'!$D$2:$D$10003,SMALL(IF('quantities report_secondary'!$A$2:$A$10003=N$6,ROW('quantities report_secondary'!$A$2:$A$10003)-1,\"\"),ROWS($B$8:$B25))),\"0\"))","v":""},{"$f":"IF($B25=\"\",\"\",IFERROR(INDEX('quantities report_secondary'!$D$2:$D$10003,SMALL(IF('quantities report_secondary'!$A$2:$A$10003=O$6,ROW('quantities report_secondary'!$A$2:$A$10003)-1,\"\"),ROWS($B$8:$B25))),\"0\"))","v":""},"",{"$f":"IF($B25=\"\",\"\",IFERROR(INDEX('quantities report_secondary'!$D$2:$D$10003,SMALL(IF('quantities report_secondary'!$A$2:$A$10003=Q$6,ROW('quantities report_secondary'!$A$2:$A$10003)-1,\"\"),ROWS($B$8:$B25))),\"0\"))","v":""}]
[null,{"$f":"IFERROR(INDEX('manual inputs_secondary'!M:M,SMALL(IF('manual inputs_secondary'!M:M<>\"\",ROW('manual inputs_secondary'!M:M)),ROW(21:21))),\"\")","v":""},{"$f":"IF($B26=\"\",\"\",IFERROR(INDEX('quantities report_secondary'!$D$2:$D$10003,SMALL(IF('quantities report_secondary'!$A$2:$A$10003=C$6,ROW('quantities report_secondary'!$A$2:$A$10003)-1,\"\"),ROWS($B$8:$B26))),\"0\"))","v":""},{"$f":"IF($B26=\"\",\"\",IFERROR(INDEX('quantities report_secondary'!$D$2:$D$10003,SMALL(IF('quantities report_secondary'!$A$2:$A$10003=D$6,ROW('quantities report_secondary'!$A$2:$A$10003)-1,\"\"),ROWS($B$8:$B26))),\"0\"))","v":""},"",{"$f":"IF($B26=\"\",\"\",IFERROR(INDEX('quantities report_secondary'!$D$2:$D$10003,SMALL(IF('quantities report_secondary'!$A$2:$A$10003=F$6,ROW('quantities report_secondary'!$A$2:$A$10003)-1,\"\"),ROWS($B$8:$B26))),\"0\"))","v":""},{"$f":"IF($B26=\"\",\"\",IFERROR(INDEX('quantities report_secondary'!$D$2:$D$10003,SMALL(IF('quantities report_secondary'!$A$2:$A$10003=G$6,ROW('quantities report_secondary'!$A$2:$A$10003)-1,\"\"),ROWS($B$8:$B26))),\"0\"))","v":""},"",{"$f":"IF($B26=\"\",\"\",IFERROR(INDEX('quantities report_secondary'!$D$2:$D$10003,SMALL(IF('quantities report_secondary'!$A$2:$A$10003=I$6,ROW('quantities report_secondary'!$A$2:$A$10003)-1,\"\"),ROWS($B$8:$B26))),\"0\"))","v":""},{"$f":"IF($B26=\"\",\"\",IFERROR(INDEX('quantities report_secondary'!$D$2:$D$10003,SMALL(IF('quantities report_secondary'!$A$2:$A$10003=J$6,ROW('quantities report_secondary'!$A$2:$A$10003)-1,\"\"),ROWS($B$8:$B26))),\"0\"))","v":""},{"$f":"IF($B26=\"\",\"\",IFERROR(INDEX('quantities report_secondary'!$D$2:$D$10003,SMALL(IF('quantities report_secondary'!$A$2:$A$10003=K$6,ROW('quantities report_secondary'!$A$2:$A$10003)-1,\"\"),ROWS($B$8:$B26))),\"0\"))","v":""},{"$f":"IF($B26=\"\",\"\",IFERROR(INDEX('quantities report_secondary'!$D$2:$D$10003,SMALL(IF('quantities report_secondary'!$A$2:$A$10003=L$6,ROW('quantities report_secondary'!$A$2:$A$10003)-1,\"\"),ROWS($B$8:$B26))),\"0\"))","v":""},{"$f":"IF($B26=\"\",\"\",IFERROR(INDEX('quantities report_secondary'!$D$2:$D$10003,SMALL(IF('quantities report_secondary'!$A$2:$A$10003=M$6,ROW('quantities report_secondary'!$A$2:$A$10003)-1,\"\"),ROWS($B$8:$B26))),\"0\"))","v":""},{"$f":"IF($B26=\"\",\"\",IFERROR(INDEX('quantities report_secondary'!$D$2:$D$10003,SMALL(IF('quantities report_secondary'!$A$2:$A$10003=N$6,ROW('quantities report_secondary'!$A$2:$A$10003)-1,\"\"),ROWS($B$8:$B26))),\"0\"))","v":""},{"$f":"IF($B26=\"\",\"\",IFERROR(INDEX('quantities report_secondary'!$D$2:$D$10003,SMALL(IF('quantities report_secondary'!$A$2:$A$10003=O$6,ROW('quantities report_secondary'!$A$2:$A$10003)-1,\"\"),ROWS($B$8:$B26))),\"0\"))","v":""},"",{"$f":"IF($B26=\"\",\"\",IFERROR(INDEX('quantities report_secondary'!$D$2:$D$10003,SMALL(IF('quantities report_secondary'!$A$2:$A$10003=Q$6,ROW('quantities report_secondary'!$A$2:$A$10003)-1,\"\"),ROWS($B$8:$B26))),\"0\"))","v":""}]
[null,{"$f":"IFERROR(INDEX('manual inputs_secondary'!M:M,SMALL(IF('manual inputs_secondary'!M:M<>\"\",ROW('manual inputs_secondary'!M:M)),ROW(22:22))),\"\")","v":""},{"$f":"IF($B27=\"\",\"\",IFERROR(INDEX('quantities report_secondary'!$D$2:$D$10003,SMALL(IF('quantities report_secondary'!$A$2:$A$10003=C$6,ROW('quantities report_secondary'!$A$2:$A$10003)-1,\"\"),ROWS($B$8:$B27))),\"0\"))","v":""},{"$f":"IF($B27=\"\",\"\",IFERROR(INDEX('quantities report_secondary'!$D$2:$D$10003,SMALL(IF('quantities report_secondary'!$A$2:$A$10003=D$6,ROW('quantities report_secondary'!$A$2:$A$10003)-1,\"\"),ROWS($B$8:$B27))),\"0\"))","v":""},"",{"$f":"IF($B27=\"\",\"\",IFERROR(INDEX('quantities report_secondary'!$D$2:$D$10003,SMALL(IF('quantities report_secondary'!$A$2:$A$10003=F$6,ROW('quantities report_secondary'!$A$2:$A$10003)-1,\"\"),ROWS($B$8:$B27))),\"0\"))","v":""},{"$f":"IF($B27=\"\",\"\",IFERROR(INDEX('quantities report_secondary'!$D$2:$D$10003,SMALL(IF('quantities report_secondary'!$A$2:$A$10003=G$6,ROW('quantities report_secondary'!$A$2:$A$10003)-1,\"\"),ROWS($B$8:$B27))),\"0\"))","v":""},"",{"$f":"IF($B27=\"\",\"\",IFERROR(INDEX('quantities report_secondary'!$D$2:$D$10003,SMALL(IF('quantities report_secondary'!$A$2:$A$10003=I$6,ROW('quantities report_secondary'!$A$2:$A$10003)-1,\"\"),ROWS($B$8:$B27))),\"0\"))","v":""},{"$f":"IF($B27=\"\",\"\",IFERROR(INDEX('quantities report_secondary'!$D$2:$D$10003,SMALL(IF('quantities report_secondary'!$A$2:$A$10003=J$6,ROW('quantities report_secondary'!$A$2:$A$10003)-1,\"\"),ROWS($B$8:$B27))),\"0\"))","v":""},{"$f":"IF($B27=\"\",\"\",IFERROR(INDEX('quantities report_secondary'!$D$2:$D$10003,SMALL(IF('quantities report_secondary'!$A$2:$A$10003=K$6,ROW('quantities report_secondary'!$A$2:$A$10003)-1,\"\"),ROWS($B$8:$B27))),\"0\"))","v":""},{"$f":"IF($B27=\"\",\"\",IFERROR(INDEX('quantities report_secondary'!$D$2:$D$10003,SMALL(IF('quantities report_secondary'!$A$2:$A$10003=L$6,ROW('quantities report_secondary'!$A$2:$A$10003)-1,\"\"),ROWS($B$8:$B27))),\"0\"))","v":""},{"$f":"IF($B27=\"\",\"\",IFERROR(INDEX('quantities report_secondary'!$D$2:$D$10003,SMALL(IF('quantities report_secondary'!$A$2:$A$10003=M$6,ROW('quantities report_secondary'!$A$2:$A$10003)-1,\"\"),ROWS($B$8:$B27))),\"0\"))","v":""},{"$f":"IF($B27=\"\",\"\",IFERROR(INDEX('quantities report_secondary'!$D$2:$D$10003,SMALL(IF('quantities report_secondary'!$A$2:$A$10003=N$6,ROW('quantities report_secondary'!$A$2:$A$10003)-1,\"\"),ROWS($B$8:$B27))),\"0\"))","v":""},{"$f":"IF($B27=\"\",\"\",IFERROR(INDEX('quantities report_secondary'!$D$2:$D$10003,SMALL(IF('quantities report_secondary'!$A$2:$A$10003=O$6,ROW('quantities report_secondary'!$A$2:$A$10003)-1,\"\"),ROWS($B$8:$B27))),\"0\"))","v":""},"",{"$f":"IF($B27=\"\",\"\",IFERROR(INDEX('quantities report_secondary'!$D$2:$D$10003,SMALL(IF('quantities report_secondary'!$A$2:$A$10003=Q$6,ROW('quantities report_secondary'!$A$2:$A$10003)-1,\"\"),ROWS($B$8:$B27))),\"0\"))","v":""}]
[null,{"$f":"IFERROR(INDEX('manual inputs_secondary'!M:M,SMALL(IF('manual inputs_secondary'!M:M<>\"\",ROW('manual inputs_secondary'!M:M)),ROW(23:23))),\"\")","v":""},{"$f":"IF($B28=\"\",\"\",IFERROR(INDEX('quantities report_secondary'!$D$2:$D$10003,SMALL(IF('quantities report_secondary'!$A$2:$A$10003=C$6,ROW('quantities report_secondary'!$A$2:$A$10003)-1,\"\"),ROWS($B$8:$B28))),\"0\"))","v":""},{"$f":"IF($B28=\"\",\"\",IFERROR(INDEX('quantities report_secondary'!$D$2:$D$10003,SMALL(IF('quantities report_secondary'!$A$2:$A$10003=D$6,ROW('quantities report_secondary'!$A$2:$A$10003)-1,\"\"),ROWS($B$8:$B28))),\"0\"))","v":""},"",{"$f":"IF($B28=\"\",\"\",IFERROR(INDEX('quantities report_secondary'!$D$2:$D$10003,SMALL(IF('quantities report_secondary'!$A$2:$A$10003=F$6,ROW('quantities report_secondary'!$A$2:$A$10003)-1,\"\"),ROWS($B$8:$B28))),\"0\"))","v":""},{"$f":"IF($B28=\"\",\"\",IFERROR(INDEX('quantities report_secondary'!$D$2:$D$10003,SMALL(IF('quantities report_secondary'!$A$2:$A$10003=G$6,ROW('quantities report_secondary'!$A$2:$A$10003)-1,\"\"),ROWS($B$8:$B28))),\"0\"))","v":""},"",{"$f":"IF($B28=\"\",\"\",IFERROR(INDEX('quantities report_secondary'!$D$2:$D$10003,SMALL(IF('quantities report_secondary'!$A$2:$A$10003=I$6,ROW('quantities report_secondary'!$A$2:$A$10003)-1,\"\"),ROWS($B$8:$B28))),\"0\"))","v":""},{"$f":"IF($B28=\"\",\"\",IFERROR(INDEX('quantities report_secondary'!$D$2:$D$10003,SMALL(IF('quantities report_secondary'!$A$2:$A$10003=J$6,ROW('quantities report_secondary'!$A$2:$A$10003)-1,\"\"),ROWS($B$8:$B28))),\"0\"))","v":""},{"$f":"IF($B28=\"\",\"\",IFERROR(INDEX('quantities report_secondary'!$D$2:$D$10003,SMALL(IF('quantities report_secondary'!$A$2:$A$10003=K$6,ROW('quantities report_secondary'!$A$2:$A$10003)-1,\"\"),ROWS($B$8:$B28))),\"0\"))","v":""},{"$f":"IF($B28=\"\",\"\",IFERROR(INDEX('quantities report_secondary'!$D$2:$D$10003,SMALL(IF('quantities report_secondary'!$A$2:$A$10003=L$6,ROW('quantities report_secondary'!$A$2:$A$10003)-1,\"\"),ROWS($B$8:$B28))),\"0\"))","v":""},{"$f":"IF($B28=\"\",\"\",IFERROR(INDEX('quantities report_secondary'!$D$2:$D$10003,SMALL(IF('quantities report_secondary'!$A$2:$A$10003=M$6,ROW('quantities report_secondary'!$A$2:$A$10003)-1,\"\"),ROWS($B$8:$B28))),\"0\"))","v":""},{"$f":"IF($B28=\"\",\"\",IFERROR(INDEX('quantities report_secondary'!$D$2:$D$10003,SMALL(IF('quantities report_secondary'!$A$2:$A$10003=N$6,ROW('quantities report_secondary'!$A$2:$A$10003)-1,\"\"),ROWS($B$8:$B28))),\"0\"))","v":""},{"$f":"IF($B28=\"\",\"\",IFERROR(INDEX('quantities report_secondary'!$D$2:$D$10003,SMALL(IF('quantities report_secondary'!$A$2:$A$10003=O$6,ROW('quantities report_secondary'!$A$2:$A$10003)-1,\"\"),ROWS($B$8:$B28))),\"0\"))","v":""},"",{"$f":"IF($B28=\"\",\"\",IFERROR(INDEX('quantities report_secondary'!$D$2:$D$10003,SMALL(IF('quantities report_secondary'!$A$2:$A$10003=Q$6,ROW('quantities report_secondary'!$A$2:$A$10003)-1,\"\"),ROWS($B$8:$B28))),\"0\"))","v":""}]
[null,{"$f":"IFERROR(INDEX('manual inputs_secondary'!M:M,SMALL(IF('manual inputs_secondary'!M:M<>\"\",ROW('manual inputs_secondary'!M:M)),ROW(24:24))),\"\")","v":""},{"$f":"IF($B29=\"\",\"\",IFERROR(INDEX('quantities report_secondary'!$D$2:$D$10003,SMALL(IF('quantities report_secondary'!$A$2:$A$10003=C$6,ROW('quantities report_secondary'!$A$2:$A$10003)-1,\"\"),ROWS($B$8:$B29))),\"0\"))","v":""},{"$f":"IF($B29=\"\",\"\",IFERROR(INDEX('quantities report_secondary'!$D$2:$D$10003,SMALL(IF('quantities report_secondary'!$A$2:$A$10003=D$6,ROW('quantities report_secondary'!$A$2:$A$10003)-1,\"\"),ROWS($B$8:$B29))),\"0\"))","v":""},"",{"$f":"IF($B29=\"\",\"\",IFERROR(INDEX('quantities report_secondary'!$D$2:$D$10003,SMALL(IF('quantities report_secondary'!$A$2:$A$10003=F$6,ROW('quantities report_secondary'!$A$2:$A$10003)-1,\"\"),ROWS($B$8:$B29))),\"0\"))","v":""},{"$f":"IF($B29=\"\",\"\",IFERROR(INDEX('quantities report_secondary'!$D$2:$D$10003,SMALL(IF('quantities report_secondary'!$A$2:$A$10003=G$6,ROW('quantities report_secondary'!$A$2:$A$10003)-1,\"\"),ROWS($B$8:$B29))),\"0\"))","v":""},"",{"$f":"IF($B29=\"\",\"\",IFERROR(INDEX('quantities report_secondary'!$D$2:$D$10003,SMALL(IF('quantities report_secondary'!$A$2:$A$10003=I$6,ROW('quantities report_secondary'!$A$2:$A$10003)-1,\"\"),ROWS($B$8:$B29))),\"0\"))","v":""},{"$f":"IF($B29=\"\",\"\",IFERROR(INDEX('quantities report_secondary'!$D$2:$D$10003,SMALL(IF('quantities report_secondary'!$A$2:$A$10003=J$6,ROW('quantities report_secondary'!$A$2:$A$10003)-1,\"\"),ROWS($B$8:$B29))),\"0\"))","v":""},{"$f":"IF($B29=\"\",\"\",IFERROR(INDEX('quantities report_secondary'!$D$2:$D$10003,SMALL(IF('quantities report_secondary'!$A$2:$A$10003=K$6,ROW('quantities report_secondary'!$A$2:$A$10003)-1,\"\"),ROWS($B$8:$B29))),\"0\"))","v":""},{"$f":"IF($B29=\"\",\"\",IFERROR(INDEX('quantities report_secondary'!$D$2:$D$10003,SMALL(IF('quantities report_secondary'!$A$2:$A$10003=L$6,ROW('quantities report_secondary'!$A$2:$A$10003)-1,\"\"),ROWS($B$8:$B29))),\"0\"))","v":""},{"$f":"IF($B29=\"\",\"\",IFERROR(INDEX('quantities report_secondary'!$D$2:$D$10003,SMALL(IF('quantities report_secondary'!$A$2:$A$10003=M$6,ROW('quantities report_secondary'!$A$2:$A$10003)-1,\"\"),ROWS($B$8:$B29))),\"0\"))","v":""},{"$f":"IF($B29=\"\",\"\",IFERROR(INDEX('quantities report_secondary'!$D$2:$D$10003,SMALL(IF('quantities report_secondary'!$A$2:$A$10003=N$6,ROW('quantities report_secondary'!$A$2:$A$10003)-1,\"\"),ROWS($B$8:$B29))),\"0\"))","v":""},{"$f":"IF($B29=\"\",\"\",IFERROR(INDEX('quantities report_secondary'!$D$2:$D$10003,SMALL(IF('quantities report_secondary'!$A$2:$A$10003=O$6,ROW('quantities report_secondary'!$A$2:$A$10003)-1,\"\"),ROWS($B$8:$B29))),\"0\"))","v":""},"",{"$f":"IF($B29=\"\",\"\",IFERROR(INDEX('quantities report_secondary'!$D$2:$D$10003,SMALL(IF('quantities report_secondary'!$A$2:$A$10003=Q$6,ROW('quantities report_secondary'!$A$2:$A$10003)-1,\"\"),ROWS($B$8:$B29))),\"0\"))","v":""}]
[null,{"$f":"IFERROR(INDEX('manual inputs_secondary'!M:M,SMALL(IF('manual inputs_secondary'!M:M<>\"\",ROW('manual inputs_secondary'!M:M)),ROW(25:25))),\"\")","v":""},{"$f":"IF($B30=\"\",\"\",IFERROR(INDEX('quantities report_secondary'!$D$2:$D$10003,SMALL(IF('quantities report_secondary'!$A$2:$A$10003=C$6,ROW('quantities report_secondary'!$A$2:$A$10003)-1,\"\"),ROWS($B$8:$B30))),\"0\"))","v":""},{"$f":"IF($B30=\"\",\"\",IFERROR(INDEX('quantities report_secondary'!$D$2:$D$10003,SMALL(IF('quantities report_secondary'!$A$2:$A$10003=D$6,ROW('quantities report_secondary'!$A$2:$A$10003)-1,\"\"),ROWS($B$8:$B30))),\"0\"))","v":""},"",{"$f":"IF($B30=\"\",\"\",IFERROR(INDEX('quantities report_secondary'!$D$2:$D$10003,SMALL(IF('quantities report_secondary'!$A$2:$A$10003=F$6,ROW('quantities report_secondary'!$A$2:$A$10003)-1,\"\"),ROWS($B$8:$B30))),\"0\"))","v":""},{"$f":"IF($B30=\"\",\"\",IFERROR(INDEX('quantities report_secondary'!$D$2:$D$10003,SMALL(IF('quantities report_secondary'!$A$2:$A$10003=G$6,ROW('quantities report_secondary'!$A$2:$A$10003)-1,\"\"),ROWS($B$8:$B30))),\"0\"))","v":""},"",{"$f":"IF($B30=\"\",\"\",IFERROR(INDEX('quantities report_secondary'!$D$2:$D$10003,SMALL(IF('quantities report_secondary'!$A$2:$A$10003=I$6,ROW('quantities report_secondary'!$A$2:$A$10003)-1,\"\"),ROWS($B$8:$B30))),\"0\"))","v":""},{"$f":"IF($B30=\"\",\"\",IFERROR(INDEX('quantities report_secondary'!$D$2:$D$10003,SMALL(IF('quantities report_secondary'!$A$2:$A$10003=J$6,ROW('quantities report_secondary'!$A$2:$A$10003)-1,\"\"),ROWS($B$8:$B30))),\"0\"))","v":""},{"$f":"IF($B30=\"\",\"\",IFERROR(INDEX('quantities report_secondary'!$D$2:$D$10003,SMALL(IF('quantities report_secondary'!$A$2:$A$10003=K$6,ROW('quantities report_secondary'!$A$2:$A$10003)-1,\"\"),ROWS($B$8:$B30))),\"0\"))","v":""},{"$f":"IF($B30=\"\",\"\",IFERROR(INDEX('quantities report_secondary'!$D$2:$D$10003,SMALL(IF('quantities report_secondary'!$A$2:$A$10003=L$6,ROW('quantities report_secondary'!$A$2:$A$10003)-1,\"\"),ROWS($B$8:$B30))),\"0\"))","v":""},{"$f":"IF($B30=\"\",\"\",IFERROR(INDEX('quantities report_secondary'!$D$2:$D$10003,SMALL(IF('quantities report_secondary'!$A$2:$A$10003=M$6,ROW('quantities report_secondary'!$A$2:$A$10003)-1,\"\"),ROWS($B$8:$B30))),\"0\"))","v":""},{"$f":"IF($B30=\"\",\"\",IFERROR(INDEX('quantities report_secondary'!$D$2:$D$10003,SMALL(IF('quantities report_secondary'!$A$2:$A$10003=N$6,ROW('quantities report_secondary'!$A$2:$A$10003)-1,\"\"),ROWS($B$8:$B30))),\"0\"))","v":""},{"$f":"IF($B30=\"\",\"\",IFERROR(INDEX('quantities report_secondary'!$D$2:$D$10003,SMALL(IF('quantities report_secondary'!$A$2:$A$10003=O$6,ROW('quantities report_secondary'!$A$2:$A$10003)-1,\"\"),ROWS($B$8:$B30))),\"0\"))","v":""},"",{"$f":"IF($B30=\"\",\"\",IFERROR(INDEX('quantities report_secondary'!$D$2:$D$10003,SMALL(IF('quantities report_secondary'!$A$2:$A$10003=Q$6,ROW('quantities report_secondary'!$A$2:$A$10003)-1,\"\"),ROWS($B$8:$B30))),\"0\"))","v":""}]
[null,{"$f":"IFERROR(INDEX('manual inputs_secondary'!M:M,SMALL(IF('manual inputs_secondary'!M:M<>\"\",ROW('manual inputs_secondary'!M:M)),ROW(26:26))),\"\")","v":""},{"$f":"IF($B31=\"\",\"\",IFERROR(INDEX('quantities report_secondary'!$D$2:$D$10003,SMALL(IF('quantities report_secondary'!$A$2:$A$10003=C$6,ROW('quantities report_secondary'!$A$2:$A$10003)-1,\"\"),ROWS($B$8:$B31))),\"0\"))","v":""},{"$f":"IF($B31=\"\",\"\",IFERROR(INDEX('quantities report_secondary'!$D$2:$D$10003,SMALL(IF('quantities report_secondary'!$A$2:$A$10003=D$6,ROW('quantities report_secondary'!$A$2:$A$10003)-1,\"\"),ROWS($B$8:$B31))),\"0\"))","v":""},"",{"$f":"IF($B31=\"\",\"\",IFERROR(INDEX('quantities report_secondary'!$D$2:$D$10003,SMALL(IF('quantities report_secondary'!$A$2:$A$10003=F$6,ROW('quantities report_secondary'!$A$2:$A$10003)-1,\"\"),ROWS($B$8:$B31))),\"0\"))","v":""},{"$f":"IF($B31=\"\",\"\",IFERROR(INDEX('quantities report_secondary'!$D$2:$D$10003,SMALL(IF('quantities report_secondary'!$A$2:$A$10003=G$6,ROW('quantities report_secondary'!$A$2:$A$10003)-1,\"\"),ROWS($B$8:$B31))),\"0\"))","v":""},"",{"$f":"IF($B31=\"\",\"\",IFERROR(INDEX('quantities report_secondary'!$D$2:$D$10003,SMALL(IF('quantities report_secondary'!$A$2:$A$10003=I$6,ROW('quantities report_secondary'!$A$2:$A$10003)-1,\"\"),ROWS($B$8:$B31))),\"0\"))","v":""},{"$f":"IF($B31=\"\",\"\",IFERROR(INDEX('quantities report_secondary'!$D$2:$D$10003,SMALL(IF('quantities report_secondary'!$A$2:$A$10003=J$6,ROW('quantities report_secondary'!$A$2:$A$10003)-1,\"\"),ROWS($B$8:$B31))),\"0\"))","v":""},{"$f":"IF($B31=\"\",\"\",IFERROR(INDEX('quantities report_secondary'!$D$2:$D$10003,SMALL(IF('quantities report_secondary'!$A$2:$A$10003=K$6,ROW('quantities report_secondary'!$A$2:$A$10003)-1,\"\"),ROWS($B$8:$B31))),\"0\"))","v":""},{"$f":"IF($B31=\"\",\"\",IFERROR(INDEX('quantities report_secondary'!$D$2:$D$10003,SMALL(IF('quantities report_secondary'!$A$2:$A$10003=L$6,ROW('quantities report_secondary'!$A$2:$A$10003)-1,\"\"),ROWS($B$8:$B31))),\"0\"))","v":""},{"$f":"IF($B31=\"\",\"\",IFERROR(INDEX('quantities report_secondary'!$D$2:$D$10003,SMALL(IF('quantities report_secondary'!$A$2:$A$10003=M$6,ROW('quantities report_secondary'!$A$2:$A$10003)-1,\"\"),ROWS($B$8:$B31))),\"0\"))","v":""},{"$f":"IF($B31=\"\",\"\",IFERROR(INDEX('quantities report_secondary'!$D$2:$D$10003,SMALL(IF('quantities report_secondary'!$A$2:$A$10003=N$6,ROW('quantities report_secondary'!$A$2:$A$10003)-1,\"\"),ROWS($B$8:$B31))),\"0\"))","v":""},{"$f":"IF($B31=\"\",\"\",IFERROR(INDEX('quantities report_secondary'!$D$2:$D$10003,SMALL(IF('quantities report_secondary'!$A$2:$A$10003=O$6,ROW('quantities report_secondary'!$A$2:$A$10003)-1,\"\"),ROWS($B$8:$B31))),\"0\"))","v":""},"",{"$f":"IF($B31=\"\",\"\",IFERROR(INDEX('quantities report_secondary'!$D$2:$D$10003,SMALL(IF('quantities report_secondary'!$A$2:$A$10003=Q$6,ROW('quantities report_secondary'!$A$2:$A$10003)-1,\"\"),ROWS($B$8:$B31))),\"0\"))","v":""}]
[null,{"$f":"IFERROR(INDEX(#REF!,SMALL(IF(#REF!<>\"\",ROW(#REF!)),ROW(27:27))),\"\")","v":""}]

{"sheet":"calc wrksht-rdwy exc Secondary","index":20,"n_rows":52,"n_cols":5,"rows_kept":52,"cut":false,"hidden":true,"merged":[[1,1,1,4]]}
[]
[null,"EARTHWORK SUMMARY\nUSING ROADWAY EXCAVATION AND EITHER BORROW OR WASTE PAY ITEMS"]
[]
[null,"EXCAVATION (unadjusted volumes)"]
[null,null,"Total Roadway Prism Excavation =",{"$f":"SUM(Grading_secondary!F3)","v":0},"CUYD"]
[null,null,"Total Approach Road Prism Excavation =",{"$f":"Grading_secondary!E3","v":0},"CUYD"]
[null,null,"Total Pay Item 20401-0000 Roadway Excavation =",{"$f":"SUM(D5:D6)","v":0},"CUYD"]
[]
[null,"EXCAVATION MATERIAL AVAILABLE FOR FILL (unadjusted volumes)"]
[null,null,"Total Structure Excavation (walls) =",{"$f":"Grading_secondary!G3","v":0},"CUYD"]
[null,null,"Total Excavation from Roadway Obliteration = ",{"$f":"Grading_secondary!H3","v":0},"CUYD"]
[null,null,"Total Subexcavation =",{"$f":"Grading_secondary!I3","v":0},"CUYD"]
[null,null,"Total =",{"$f":"SUM(D10:D12)","v":0},"CUYD"]
[]
[null,"EXCAVATION MATERIAL UNAVAILABLE FOR FILL (unadjusted volumes)"]
[null,null,"Total Pavement Removal in Cuts =",{"$f":"Grading_secondary!J3","v":0},"CUYD"]
[null,null,"Total Topsoil Stripping in Cuts =",{"$f":"Grading_secondary!K3","v":0},"CUYD"]
[null,null,"Total Waste Subexcavation =",{"$f":"Grading_secondary!L3","v":0},"CUYD"]
[null,null,"Total =",{"$f":"SUM(D16:D18)","v":0},"CUYD"]
[]
[null,"TOTAL EXCAVATION AVAILABLE FOR FILLS (adjusted volume)"]
[null,null,"Total Volume After Adjustments Applied (Including Shrink/Swell) =",{"$f":"Grading_secondary!N3","v":0},"CUYD"]
[]
[null,"EMBANKMENT (unadjusted volumes)"]
[null,null,"Total Roadway Prism Fill =",{"$f":"Grading_secondary!P3","v":0},"CUYD"]
[null,null,"Total Approach Road Prism Fill =",{"$f":"Grading_secondary!Q3","v":0},"CUYD"]
[null,null,"Total =",{"$f":"SUM(D25:D26)","v":0},"CUYD"]
[]
[null,"VARIOUS BACKFILL MATERIAL GENERATED ONSITE"]
[null,null,"Total Various Types of Wall Backfill Material =",{"$f":"SUM(Grading_secondary!S3:Z3)","v":0},"CUYD"]
[null,null,"Total Backfill for Pavement Removal Under Fill =",{"$f":"Grading_secondary!AA3","v":0},"CUYD"]
[null,null,"Total Topsoil Replacement Under Fill =",{"$f":"Grading_secondary!AB3","v":0},"CUYD"]
[null,null,"Total Volume for Riprap =",{"$f":"Grading_secondary!AE3","v":0},"CUYD"]
[null,null,"Total Volume for Special Rock Embankment =",{"$f":"Grading_secondary!AF3","v":0},"CUYD"]
[null,null,"Total Embankment for Roadway Obliteration =",{"$f":"Grading_secondary!AG3","v":0},"CUYD"]
[null,null,"Total Subexcavation =",{"$f":"Grading_secondary!AC3","v":0},"CUYD"]
[null,null,"Total Volume for Topping or Select Topping =",{"$f":"Grading_secondary!AH3","v":0},"CUYD"]
[null,null,"Total Volume for Aggregate Base =",{"$f":"Grading_secondary!AD3","v":0},"CUYD"]
[null,null,"Total =",{"$f":"SUM(D30:D38)","v":0},"CUYD"]
[]
[null,"EXCAVATION MINUS EMBANKMENT"]
[null,null,"Total Estimated Excavation Available for Fills =",{"$f":"D22","v":0},"CUYD"]
[null,null,"Total Estimated Fill Material Required =",{"$f":"D27+D39","v":0},"CUYD"]
[null,null,"Excavation - Embankment = ",{"$f":"D42-D43","v":0},"CUYD"]
[]
[null,"WASTE"]
[null,null,"Estimated Total Pay Item 20441-0000 Waste =",{"$f":"IF(D44>0,D44,\"NA\")","v":"NA"},"CUYD"]
[]
[null,"BORROW"]
[null,null,"Estimated Unadjusted Volume of Unclassified Borrow Required =",{"$f":"IF(D44<0,ABS(D44), \"NA\" )","v":"NA"},"CUYD"]
[null,null,"Estimated Shrink / Swell at Borrow Pit Site =",0.9]
[null,null,"Estimated Total Pay Item 20403-0000 Unclassified Borrow  =",{"$f":"IF(D50=\"NA\",\"NA\",ABS((ROUNDUP(D50/D51,0))))","v":"NA"},"CUYD"]

{"sheet":"calc wrksht-emb const Secondary","index":21,"n_rows":52,"n_cols":5,"rows_kept":52,"cut":false,"hidden":true,"merged":[[1,1,1,4]]}
[]
[null,"EARTHWORK SUMMARY\nUSING EMBANKMENT CONSTRUCTION PAY ITEM"]
[]
[null,"EXCAVATION (unadjusted volumes)"]
[null,null,"Total Roadway Prism Excavation =",{"$f":"SUM(Grading_secondary!F3)","v":0},"CUYD"]
[null,null,"Total Approach Road Prism Excavation =",{"$f":"Grading_secondary!E3","v":0},"CUYD"]
[null,null,"Total =",{"$f":"SUM(D5:D6)","v":0},"CUYD"]
[]
[null,"EXCAVATION MATERIAL AVAILABLE FOR FILL (unadjusted volumes)"]
[null,null,"Total Structure Excavation (walls) =",{"$f":"Grading_secondary!G3","v":0},"CUYD"]
[null,null,"Total Excavation from Roadway Obliteration = ",{"$f":"Grading_secondary!H3","v":0},"CUYD"]
[null,null,"Total Subexcavation =",{"$f":"Grading_secondary!I3","v":0},"CUYD"]
[null,null,"Total =",{"$f":"SUM(D10:D12)","v":0},"CUYD"]
[]
[null,"EXCAVATION MATERIAL UNAVAILABLE FOR FILL (unadjusted volumes)"]
[null,null,"Total Pavement Removal in Cuts =",{"$f":"Grading_secondary!J3","v":0},"CUYD"]
[null,null,"Total Topsoil Stripping in Cuts =",{"$f":"Grading_secondary!K3","v":0},"CUYD"]
[null,null,"Total Waste Subexcavation =",{"$f":"Grading_secondary!L3","v":0},"CUYD"]
[null,null,"Total =",{"$f":"SUM(D16:D18)","v":0},"CUYD"]
[]
[null,"TOTAL EXCAVATION AVAILABLE FOR FILLS (adjusted volume)"]
[null,null,"Total Volume After Adjustments Applied (Including Shrink/Swell) =",{"$f":"Grading_secondary!N3","v":0},"CUYD"]
[]
[null,"EMBANKMENT (unadjusted volumes)"]
[null,null,"Total Roadway Prism Fill =",{"$f":"Grading_secondary!P3","v":0},"CUYD"]
[null,null,"Total Approach Road Prism Fill =",{"$f":"Grading_secondary!Q3","v":0},"CUYD"]
[null,null,"Total =",{"$f":"SUM(D25:D26)","v":0},"CUYD"]
[]
[null,"VARIOUS BACKFILL MATERIAL GENERATED ONSITE"]
[null,null,"Total Various Types of Wall Backfill Material =",{"$f":"SUM(Grading_secondary!S3:Z3)","v":0},"CUYD"]
[null,null,"Total Backfill for Pavement Removal Under Fill =",{"$f":"Grading_secondary!AA3","v":0},"CUYD"]
[null,null,"Total Topsoil Replacement Under Fill =",{"$f":"Grading_secondary!AB3","v":0},"CUYD"]
[null,null,"Total Volume for Riprap =",{"$f":"Grading_secondary!AE3","v":0},"CUYD"]
[null,null,"Total Volume for Special Rock Embankment =",{"$f":"Grading_secondary!AF3","v":0},"CUYD"]
[null,null,"Total Embankment for Roadway Obliteration =",{"$f":"Grading_secondary!AG3","v":0},"CUYD"]
[null,null,"Total Subexcavation =",{"$f":"Grading_secondary!AC3","v":0},"CUYD"]
[null,null,"Total Volume for Topping or Select Topping =",{"$f":"Grading_secondary!AH3","v":0},"CUYD"]
[null,null,"Total Volume for Aggregate Base =",{"$f":"Grading_secondary!AD3","v":0},"CUYD"]
[null,null,"Total =",{"$f":"SUM(D30:D38)","v":0},"CUYD"]
[]
[null,"EXCAVATION MINUS EMBANKMENT"]
[null,null,"Total Estimated Excavation Available for Fills =",{"$f":"D22","v":0},"CUYD"]
[null,null,"Total Estimated Fill Material Required =",{"$f":"D27+D39","v":0},"CUYD"]
[null,null,"Excavation - Embankment = ",{"$f":"D42-D43","v":0},"CUYD"]
[]
[null,"EMBANKMENT CONSTRUCTION"]
[null,null,"Estimated Total Pay Item 20420-0000 Embankment Construction =",{"$f":"D27","v":0},"CUYD"]
[]
[null,"UNCLASSIFIED BORROW"]
[null,null,"Estimated Unadjusted Volume of Unclassified Borrow Required =",{"$f":"ABS(Grading_secondary!AM3)","v":0},"CUYD"]
[null,null,"Estimated Shrink / Swell at Borrow Pit Site =",{"$f":"Grading_secondary!AN3","v":0.89999999999999969}]
[null,null,"Estimated Quantity of Unclassified Borrow Required =",{"$f":"Grading_secondary!AN3","v":0.89999999999999969},"CUYD"]